Debian Package rebuild

Rebuild of the Debian archive with clang

"Exception specification in declaration does not match previous declaration" build failure(s)
clang 6.0
Return to the list

Versions: 2.9 - 3.0 - 3.1 - 3.2 - 3.3 - 3.4 - 3.4.2 - 3.5.0 - 3.6.0 - 3.8.1 - 3.9.1 - 4.0.1 - 5.0 - 6.0
PackageVersionSupposed error messageFull log Bug report
exactimage 1.0.1-2stdlib.h:558:14: error: exception specification in declaration does not match previous declaration Log
gvpe 3.0-1getopt_core.h:91:12: error: exception specification in declaration does not match previous declaration Log
spamprobe 1.4d-14stdlib.h:558:14: error: exception specification in declaration does not match previous declaration Log
3 errors
Return to the list