Debian Package rebuild

Rebuild of the Debian archive with clang

"Implicit function error" build failure(s)
clang 6.0
Return to the list

Versions: 2.9 - 3.0 - 3.1 - 3.2 - 3.3 - 3.4 - 3.4.2 - 3.5.0 - 3.6.0 - 3.8.1 - 3.9.1 - 4.0.1 - 5.0 - 6.0
PackageVersionSupposed error messageFull log Bug report
freetype 2.8.1-2ttdebug.c:1935:16: error: implicitly declaring library function 'snprintf' with type 'int (char *, unsigned long, const char *, ...)' [-Werror,-Wimplicit-function-declaration] Log
pixman 0.34.0-2../../test/utils-prng.c:207:27: error: use of unknown builtin '__builtin_shuffle' [-Wimplicit-function-declaration] Log
smpq 1.6-1append.c:64:15: error: implicit declaration of function 'strcasecmp' [-Werror,-Wimplicit-function-declaration] Log
sssd 1.16.1-1../src/providers/data_provider/dp_request.c:313:5: error: implicit declaration of function 'SSSD_DP_REQ_SEND_ENABLED' is invalid in C99 [-Werror,-Wimplicit-function-declaration] Log
4 errors
Return to the list