Debian Package rebuild

Rebuild of the Debian archive with clang

"No support of nested C function" build failure(s)
clang 6.0
Return to the list
clang rejects inner functions while gcc accepts them.
void foo() {

     void bar() {

     }

}

Versions: 2.9 - 3.0 - 3.1 - 3.2 - 3.3 - 3.4 - 3.4.2 - 3.5.0 - 3.6.0 - 3.8.1 - 3.9.1 - 4.0.1 - 5.0 - 6.0
PackageVersionSupposed error messageFull log Bug report
bluez 5.49-1profiles/midi/midi.c:79:75: error: function definition is not allowed here Log
bogl 0.1.18-13bogl-font.c:84:3: error: function definition is not allowed here Log 758063
eurephia 1.1.0-6eurephiadm.c:203:47: error: function definition is not allowed here Log
growl-for-linux 0.8.5-2balloon.c:160:72: error: function definition is not allowed here Log
kraptor 0.0.20040403+ds-1src/game.c:416:3: error: function definition is not allowed here Log 750370
liblxi 1.8-1avahi.c:175:5: error: function definition is not allowed here Log
libtickit 0.2-2t/15term-input.c:197:5: error: function definition is not allowed here Log
lxi-tools 1.15-1lxi.c:121:5: error: function definition is not allowed here Log
matchbox-panel 0.9.3-9mb-applet-battery.c:182:2: error: function definition is not allowed here Log 750784
netplug 1.2.9.2-3if_info.c:295:37: error: function definition is not allowed here Log 750789
paxtest 1:0.9.14-2body.c:39:19: error: function definition is not allowed here Log 758566
rainbow 0.8.7-2nss-rainbow.c:287:39: error: function definition is not allowed here Log 758571
ratpoints 1:2.1.3-1./sturm.c:176:5: error: function definition is not allowed here Log
rsh-redone 85-2rlogin.c:388:30: error: function definition is not allowed here Log 750957
smbc 1.2.2-4smbc.c:316:2: error: function definition is not allowed here Log
v4l-utils 1.14.2-1ir-encode.c:37:2: error: function definition is not allowed here Log
xneur 0.20.0-1text.c:292:25: error: function definition is not allowed here Log 751542
17 errors
Return to the list