Debian Package rebuild

Rebuild of the Debian archive with clang

"No matching function call" build failure(s)
clang 6.0
Return to the list

Versions: 2.9 - 3.0 - 3.1 - 3.2 - 3.3 - 3.4 - 3.4.2 - 3.5.0 - 3.6.0 - 3.8.1 - 3.9.1 - 4.0.1 - 5.0 - 6.0
PackageVersionSupposed error messageFull log Bug report
android-platform-system-core 1:7.0.0+r33-2adb/adb_auth_host.cpp:95:5: error: no matching function for call to 'RSA_get0_key' Log
asl 0.1.7-2aslMATFormat.cxx:49:3: error: no matching function for call to 'Mat_VarWrite' Log
caps 0.9.24-5./dsp/v4f.h:153:12: error: no matching function for call to 'v4f_map' Log
cython 0.26.1-0.4cpdef_extern_func.cpp:1705:25: error: no matching function for call to '__Pyx_CFunc_const__char______const__char________int___to_py' Log
4 errors
Return to the list