Debian Package rebuild

Rebuild of the Debian archive with clang

"No matching member or constructor call" build failure(s)
clang 6.0
Return to the list

Versions: 2.9 - 3.0 - 3.1 - 3.2 - 3.3 - 3.4 - 3.4.2 - 3.5.0 - 3.6.0 - 3.8.1 - 3.9.1 - 4.0.1 - 5.0 - 6.0
PackageVersionSupposed error messageFull log Bug report
dnaclust 3-5./multi_dim.hpp:62:8: error: no matching constructor for initialization of 'std::range_error' Log
fim 0.5~rc3-2./AADevice.cpp:492:11: error: no matching member function for call to 'clear_rect_' Log
gnash 0.8.11~git20160608-1.4../../librender/agg/Renderer_agg.cpp:474:22: error: no matching constructor for initialization of 'Scanline' (aka 'scanline_u8_am >') Log
liblip 2.0.0-1.2tnt_sparse_matrix_csr.h:97:3: error: no matching constructor for initialization of 'Array1D' Log
mahimahi 0.98-1./packetshell.hh:25:19: error: no matching constructor for initialization of 'NAT' Log
5 errors
Return to the list