Debian Package rebuild

Rebuild of the Debian archive with clang

"Unused variable" build failure(s)
clang 6.0
Return to the list

Versions: 2.9 - 3.0 - 3.1 - 3.2 - 3.3 - 3.4 - 3.4.2 - 3.5.0 - 3.6.0 - 3.8.1 - 3.9.1 - 4.0.1 - 5.0 - 6.0
PackageVersionSupposed error messageFull log Bug report
cbmc 5.6-1cpp_typecheck_resolve.cpp:726:34: error: unused variable 'next' [-Werror,-Wunused-variable] Log
ola 0.10.5.nojsmin-3plugins/pathport/PathportDevice.cpp:67:46: error: unused variable 'iter' [-Werror,-Wunused-variable] Log
rocksdb 5.11.3-2utilities/transactions/transaction_test.cc:2547:22: error: unused variable 'txn_options' [-Werror,-Wunused-variable] Log
zeroc-ice 3.7.1-1src/slice2cpp/Gen.cpp:1798:36: error: unused variable 'pi' [-Werror,-Wunused-variable] Log
4 errors
Return to the list