Debian Package rebuild

Rebuild of the Debian archive with clang

"Cannot be narrowed" build failure(s)
clang 7.0.1
Return to the list

Versions: 2.9 - 3.0 - 3.1 - 3.2 - 3.3 - 3.4 - 3.4.2 - 3.5.0 - 3.6.0 - 3.8.1 - 3.9.1 - 4.0.1 - 5.0 - 6.0 - 7.0.1 - 8svn
PackageVersionSupposed error messageFull log Bug report
amphetamine 0.8.10-21src/Element.cpp:282:25: error: type 'double' cannot be narrowed to 'short' in initializer list [-Wc++11-narrowing] Log
asc 2.6.1.0-5pgbutton.cpp:105:8: error: case value evaluates to 2147483649, which cannot be narrowed to type 'int' [-Wc++11-narrowing] Log
capi4hylafax 1:01.03.00.99.svn.300-20BasicFax.cpp:348:18: error: case value evaluates to -1, which cannot be narrowed to type 'tUInt' (aka 'unsigned int') [-Wc++11-narrowing] Log
eviacam 2.1.3-4.1crvmisc.cpp:57:7: error: case value evaluates to 2147483656, which cannot be narrowed to type 'int' [-Wc++11-narrowing] Log
grfcodec 6.0.6-2src/command.cpp:306:8: error: case value evaluates to -1, which cannot be narrowed to type 'uint' (aka 'unsigned int') [-Wc++11-narrowing] Log
kcm-fcitx 0.5.5-2skinpage.cpp:134:10: error: case value evaluates to 2401319027, which cannot be narrowed to type 'int' [-Wc++11-narrowing] Log
p7zip 16.02+dfsg-6../../../../CPP/Windows/ErrorMsg.cpp:18:10: error: case value evaluates to -2147467263, which cannot be narrowed to type 'DWORD' (aka 'unsigned int') [-Wc++11-narrowing] Log
pcsc-cyberjack 3.99.5final.sp09-1.1ifd.cpp:953:8: error: case value evaluates to 3221225848, which cannot be narrowed to type 'CJ_RESULT' (aka 'int') [-Wc++11-narrowing] Log
pekwm 0.1.17-3ActionHandler.cc:586:10: error: case value evaluates to 4294967286, which cannot be narrowed to type 'int' [-Wc++11-narrowing] Log
pgadmin3 1.22.2-4frm/frmEditGrid.cpp:2397:10: error: case value evaluates to -43, which cannot be narrowed to type 'OID' (aka 'unsigned long') [-Wc++11-narrowing] Log
scim 1.4.18-2.1scim_panel_gtk.cpp:2563:34: error: type 'double' cannot be narrowed to 'guint16' (aka 'unsigned short') in initializer list [-Wc++11-narrowing] Log 750115
simutrans 120.3-2gui/simwin.cc:498:11: error: case value evaluates to -1, which cannot be narrowed to type 'uint32' (aka 'unsigned int') [-Wc++11-narrowing] Log 750121
sitplus 1.0.3-5.1crvmisc.cpp:58:7: error: case value evaluates to 2147483656, which cannot be narrowed to type 'int' [-Wc++11-narrowing] Log
stressapptest 1.0.6-2worker.cc:2994:14: error: case value evaluates to -5, which cannot be narrowed to type 'unsigned long' [-Wc++11-narrowing] Log
xplc 0.3.13-7xplc/moduleloader.cpp:65:8: error: case value evaluates to -1, which cannot be narrowed to type 'unsigned int' [-Wc++11-narrowing] Log
15 errors
Return to the list