Debian Package rebuild

Rebuild of the Debian archive with clang

"Some headers could not be found" build failure(s)
clang 7.0.1
Return to the list
In some cases, the -MM option will change the include directory list. For example, the code
#include <libxml/parser.h>
will fail with clang but success with gcc.
$ gcc -MM  foo.c
foo.o: foo.c

$ clang -MM  foo.c
foo.c:1:10: fatal error: 'libxml/parser.h' file not found
#include <libxml/parser.h>
         ^
foo.o: foo.c
1 error generated.
Note all these problems are caused by -MM.
Versions: 2.9 - 3.0 - 3.1 - 3.2 - 3.3 - 3.4 - 3.4.2 - 3.5.0 - 3.6.0 - 3.8.1 - 3.9.1 - 4.0.1 - 5.0 - 6.0 - 7.0.1 - 8svn
PackageVersionSupposed error messageFull log Bug report
9menu 1.9-1Imake.tmpl:2243:10: fatal error: ' X11 .rules' file not found Log
acfax 981011-17Imake.tmpl:2243:10: fatal error: ' X11 .rules' file not found Log
apitrace 7.1+git20170623.d38a69d6+repack-3os_backtrace.cpp:48:12: fatal error: 'backtrace.h' file not found Log
ascd 0.13.2-6Imake.tmpl:2243:10: fatal error: ' X11 .rules' file not found Log
ascdc 0.3-15Imake.tmpl:2243:10: fatal error: ' X11 .rules' file not found Log
asclock 2.0.12-29Imake.tmpl:2243:10: fatal error: ' X11 .rules' file not found Log
blender 2.79.b+dfsg0-6COLLADABUhash_map.h:77:18: fatal error: 'ext/hash_fun.h' file not found Log
canna 3.7p3-14Imake.tmpl:2243:10: fatal error: ' X11 .rules' file not found Log
crtmpserver 1.0~dfsg-5.5:1:10: fatal error: 'common' file not found Log
ctwm 3.7-4Imake.tmpl:2243:10: fatal error: ' X11 .rules' file not found Log
dclock 2.2.2-10Imake.tmpl:2243:10: fatal error: ' X11 .rules' file not found Log
evolver 2.70+ds-4../../../src/include.h:61:10: fatal error: 'quadmath.h' file not found Log
flightgear 1:2018.3.1+dfsg-1fgelev.cxx:23:10: fatal error: 'iostream' file not found Log
floatbg 1.0-28Imake.tmpl:2243:10: fatal error: ' X11 .rules' file not found Log
fparserc++ 4.5.2-2mpfr/MpfrFloat.cc:3:10: fatal error: 'mpfr.h' file not found Log
fvwm1 1.24r-56Imake.tmpl:2243:10: fatal error: ' X11 .rules' file not found Log
gcin 2.8.8+dfsg1-1./gcin-imcontext-qt.h:1:10: fatal error: 'QApplication' file not found Log
google-compute-image-packages 20181206-2utils/oslogin_utils.cc:34:10: fatal error: 'boost/regex.hpp' file not found Log
kdrill 6.5deb2-12Imake.tmpl:2243:10: fatal error: ' X11 .rules' file not found Log
kinput2 3.1-13Imake.tmpl:2243:10: fatal error: ' X11 .rules' file not found Log
kismet 2016.07.R1-1nl80211_control.cc:30:10: fatal error: 'netlink/genl/genl.h' file not found Log
klibc 2.0.4-15stdarg.h:9:15: fatal error: 'stdarg.h' file not found Log
knews 1.0b.1-32Imake.tmpl:2243:10: fatal error: ' X11 .rules' file not found Log
koules 1.4-25Imake.tmpl:2243:10: fatal error: ' X11 .rules' file not found Log
libnfo 1.0.1-1.1nfo_xml_utils.c:22:10: fatal error: 'libxml/parser.h' file not found Log
libvmime 0.9.2-5base.hpp:28:10: fatal error: 'string' file not found Log
lwm 1.2.2-6Imake.tmpl:2243:10: fatal error: ' X11 .rules' file not found Log
mgdiff 1.0-30Imake.tmpl:2243:10: fatal error: ' X11 .rules' file not found Log
mgp 1.13a+upstream20090219-9Imake.tmpl:2243:10: fatal error: ' X11 .rules' file not found Log
nas 1.9.4-6Imake.tmpl:2243:10: fatal error: ' X11 .rules' file not found Log
netmaze 0.81+jpg0.82-16Imake.tmpl:2243:10: fatal error: ' X11 .rules' file not found Log
nitpic 0.1-16Imake.tmpl:2243:10: fatal error: ' X11 .rules' file not found Log
nx-libs 2:3.5.99.17-1./config/cf/Imake.tmpl:2076:10: fatal error: ' X11 .rules' file not found Log
opencollada 0.1.0~20160714.0ec5063+dfsg1-2COLLADABUhash_map.h:77:18: fatal error: 'ext/hash_fun.h' file not found Log
opendnssec 1:2.1.3-0.3../../common/janitor.c:48:10: fatal error: 'backtrace.h' file not found Log
pacemaker 1.1.19-2libcrmcommon-dev/usr/include/pacemaker/crm/crm.h:19:12: fatal error: 'glib.h' file not found Log
pacman 10-17.2Imake.tmpl:2243:10: fatal error: ' X11 .rules' file not found Log
pixmap 2.6pl4-20Imake.tmpl:2243:10: fatal error: ' X11 .rules' file not found Log
psicode 3.4.0-6ip_read.cc:15:10: fatal error: 'y.tab.h' file not found Log
rapmap 0.12.0+dfsg-3RapMap.cpp:22:10: fatal error: 'iostream' file not found Log
rasmol 2.7.6.0-1Imake.tmpl:2243:10: fatal error: ' X11 .rules' file not found Log
restbed 4.0~dfsg1-5uri.cpp:6:10: fatal error: 'regex' file not found Log
sciplot 1.36-17Imake.tmpl:2243:10: fatal error: ' X11 .rules' file not found Log
seyon 2.20c-32Imake.tmpl:2243:10: fatal error: ' X11 .rules' file not found Log
simgear 1:2018.3.1+dfsg-1In file included from /<>/simgear-2018.3.1+dfsg/simgear/bvh/BVHLineGeometry.cxx:/<>/simgear-2018.3.1+dfsg/simgear/bucket/newbucket.cxx18:30:10: fatal error: 'cmath' file not found Log
spim 8.0+dfsg-6.1Imake.tmpl:2243:10: fatal error: ' X11 .rules' file not found Log
ssvnc 1.0.29-4Imake.tmpl:2243:10: fatal error: ' X11 .rules' file not found Log
sunclock 3.57-9Imake.tmpl:2243:10: fatal error: ' X11 .rules' file not found Log
supercollider-sc3-plugins 3.9.1~repack-2SC_SndBuf.h:30:10: fatal error: 'atomic' file not found Log
syslinux 3:6.04~git20171011.af7e95c3+dfsg1-6stdarg.h:9:15: fatal error: 'stdarg.h' file not found Log
task 2.5.1+dfsg-6Column.h:30:10: fatal error: 'vector' file not found Log
tcc 0.9.27-8tcctest.c:71:10: fatal error: ' tests/ 42test.h ' file not found Log
tgif 1:4.2.5-1.3Imake.tmpl:2243:10: fatal error: ' X11 .rules' file not found Log
thunderbird 1:60.4.0-1 0:02.08 psutil/_psutil_common.c:9:10: fatal error: 'Python.h' file not found Log
tightvnc 1:1.3.9-9Imake.tmpl:2243:10: fatal error: ' X11 .rules' file not found Log
vflib3 3.6.14.dfsg-3+nmu4Imake.tmpl:2243:10: fatal error: ' X11 .rules' file not found Log
vtwm 5.4.7-5Imake.tmpl:2243:10: fatal error: ' X11 .rules' file not found Log
w9wm 0.4.2-8Imake.tmpl:2243:10: fatal error: ' X11 .rules' file not found Log
wmdate 0.7-4.1Imake.tmpl:2243:10: fatal error: ' X11 .rules' file not found Log
wmnet 1.06-1Imake.tmpl:2243:10: fatal error: ' X11 .rules' file not found Log
wnn6-sdk 1.0.0-18Imake.tmpl:2243:10: fatal error: ' X11 .rules' file not found Log
xarclock 1.0-14Imake.tmpl:2243:10: fatal error: ' X11 .rules' file not found Log
xautolock 1:2.2-5.1Imake.tmpl:2243:10: fatal error: ' X11 .rules' file not found Log
xaw3d 1.5+E-18.3Imake.tmpl:2243:10: fatal error: ' X11 .rules' file not found Log
xcal 4.1-19Imake.tmpl:2243:10: fatal error: ' X11 .rules' file not found Log
xcb 2.4-4.3Imake.tmpl:2243:10: fatal error: ' X11 .rules' file not found Log
xcolors 1.5a-8Imake.tmpl:2243:10: fatal error: ' X11 .rules' file not found Log
xcolorsel 1.1a-20Imake.tmpl:2243:10: fatal error: ' X11 .rules' file not found Log
xdemineur 2.1.1-20Imake.tmpl:2243:10: fatal error: ' X11 .rules' file not found Log
xdu 3.0-19Imake.tmpl:2243:10: fatal error: ' X11 .rules' file not found Log
xfaces 3.3-29Imake.tmpl:2243:10: fatal error: ' X11 .rules' file not found Log
xfishtank 2.5-1Imake.tmpl:2243:10: fatal error: ' X11 .rules' file not found Log
xflip 1.01-27Imake.tmpl:2243:10: fatal error: ' X11 .rules' file not found Log
xgammon 0.99.1128-3Imake.tmpl:2243:10: fatal error: ' X11 .rules' file not found Log
xjig 2.4-14.1Imake.tmpl:2243:10: fatal error: ' X11 .rules' file not found Log
xkeycaps 2.47-5Imake.tmpl:2243:10: fatal error: ' X11 .rules' file not found Log
xlax 2.4-2Imake.tmpl:2243:10: fatal error: ' X11 .rules' file not found Log
xlbiff 4.1-7Imake.tmpl:2243:10: fatal error: ' X11 .rules' file not found Log
xmille 2.0-13Imake.tmpl:2243:10: fatal error: ' X11 .rules' file not found Log
xmix 2.1-7Imake.tmpl:2243:10: fatal error: ' X11 .rules' file not found Log
xmotd 1.17.3b-10Imake.tmpl:2243:10: fatal error: ' X11 .rules' file not found Log
xmountains 2.9-6Imake.tmpl:2243:10: fatal error: ' X11 .rules' file not found Log
xnecview 1.36-1Imake.tmpl:2243:10: fatal error: ' X11 .rules' file not found Log
xonix 1.4-31Imake.tmpl:2243:10: fatal error: ' X11 .rules' file not found Log
xpaint 2.9.1.4-3.2Imake.tmpl:2243:10: fatal error: ' X11 .rules' file not found Log
xpat2 1.07-20Imake.tmpl:2243:10: fatal error: ' X11 .rules' file not found Log
xphoon 20000613+0-5Imake.tmpl:2243:10: fatal error: ' X11 .rules' file not found Log
xscavenger 1.4.5-4Imake.tmpl:2243:10: fatal error: ' X11 .rules' file not found Log
xskat 4.0-7Imake.tmpl:2243:10: fatal error: ' X11 .rules' file not found Log
xsok 1.02-19Imake.tmpl:2243:10: fatal error: ' X11 .rules' file not found Log
xsysinfo 1.7-9Imake.tmpl:2243:10: fatal error: ' X11 .rules' file not found Log
xtel 3.3.0-22Imake.tmpl:2243:10: fatal error: ' X11 .rules' file not found Log
xtrlock 2.8Imake.tmpl:2243:10: fatal error: ' X11 .rules' file not found Log
xtv 1.1-15Imake.tmpl:2243:10: fatal error: ' X11 .rules' file not found Log
xvier 1.0-7.6Imake.tmpl:2243:10: fatal error: ' X11 .rules' file not found Log
xvkbd 3.9-1Imake.tmpl:2243:10: fatal error: ' X11 .rules' file not found Log
xxgdb 1.12-17Imake.tmpl:2243:10: fatal error: ' X11 .rules' file not found Log
xxkb 1.11-2.1Imake.tmpl:2243:10: fatal error: ' X11 .rules' file not found Log
xzoom 0.3-24Imake.tmpl:2243:10: fatal error: ' X11 .rules' file not found Log
ygl 4.2e-4Imake.tmpl:2243:10: fatal error: ' X11 .rules' file not found Log
100 errors
Return to the list