Debian Package rebuild

Rebuild of the Debian archive with clang

"Cannot find member in the struct" build failure(s)
clang 7.0.1
Return to the list

Versions: 2.9 - 3.0 - 3.1 - 3.2 - 3.3 - 3.4 - 3.4.2 - 3.5.0 - 3.6.0 - 3.8.1 - 3.9.1 - 4.0.1 - 5.0 - 6.0 - 7.0.1 - 8svn
PackageVersionSupposed error messageFull log Bug report
aegisub 3.2.2+dfsg-4util.cpp:30:2: error: no member named 'this_thread' in namespace 'std'; did you mean 'boost::this_thread'? Log
canu 1.8+dfsg-2stl_algo.h:3451:15: error: no member named 'min_element' in namespace 'std'; did you mean '__cxx1998::min_element'? Log
cgit 1.2.1+git2.18.0-1../filter.c:388:10: error: no member named '__fprintf_chk' in 'struct cgit_filter' Log
cyphesis-cpp 0.6.2-3stream.h:306:19: error: no member named 'm_poly' in 'WFMath::Polygon<2>' Log
libnftnl 1.1.2-2object.c:372:19: error: no member named '__builtin___snprintf_chk' in 'struct obj_ops' Log 755956
mercator 0.3.3-5polygon_intersect.h:667:37: error: no member named 'm_orient' in 'WFMath::Polygon<2>' Log
mgba 0.6.3+dfsg1-2cli-debugger.c:24:6: error: no member named '__printf_chk' in 'struct CLIDebuggerBackend' Log
openvswitch 2.10.0+2018.08.28+git.8ca7c82b7d+ds1-10lib/vlog.c:1119:35: error: no member named '__syslog_chk' in 'struct syslog_class' Log
8 errors
Return to the list