Debian Package rebuild

Rebuild of the Debian archive with clang

"C++11 requires a space between literal and identifier" build failure(s)
clang 7.0.1
Return to the list

Versions: 2.9 - 3.0 - 3.1 - 3.2 - 3.3 - 3.4 - 3.4.2 - 3.5.0 - 3.6.0 - 3.8.1 - 3.9.1 - 4.0.1 - 5.0 - 6.0 - 7.0.1 - 8svn
PackageVersionSupposed error messageFull log Bug report
abiword 3.0.2-8ap_UnixApp.cpp:866:29: error: invalid suffix on literal; C++11 requires a space between literal and identifier [-Wreserved-user-defined-literal] Log
alsa-tools 1.1.3-1us428control.cc:66:18: error: invalid suffix on literal; C++11 requires a space between literal and identifier [-Wreserved-user-defined-literal] Log 756805
amule 1:2.3.2-4../../../../src/webserver/src/php_syntree.cpp:929:53: error: invalid suffix on literal; C++11 requires a space between literal and identifier [-Wreserved-user-defined-literal] Log
aranym 1.0.2-2.2./src/Unix/linux/ethernet_linux.cpp:98:34: error: invalid suffix on literal; C++11 requires a space between literal and identifier [-Wreserved-user-defined-literal] Log
audex 0.79-1profilemodel.h:47:30: error: invalid suffix on literal; C++11 requires a space between literal and identifier [-Wreserved-user-defined-literal] Log
berusky 1.7.1-1./defines.h:448:43: error: invalid suffix on literal; C++11 requires a space between literal and identifier [-Wreserved-user-defined-literal] Log
bidentd 1.1.4-1.1main.cc:244:38: error: invalid suffix on literal; C++11 requires a space between literal and identifier [-Wreserved-user-defined-literal] Log
boinc-app-seti 8.00~svn3725-3../sah_config.h:784:40: error: invalid suffix on literal; C++11 requires a space between literal and identifier [-Wreserved-user-defined-literal] Log
coinor-ipopt 3.11.9-2.1IpIpoptAlg.cpp:265:69: error: invalid suffix on literal; C++11 requires a space between literal and identifier [-Wreserved-user-defined-literal] Log
comptext 1.0.1-3main.cxx:189:21: error: invalid suffix on literal; C++11 requires a space between literal and identifier [-Wreserved-user-defined-literal] Log
cpl-plugin-fors 5.3.32+dfsg-1fors_dark_impl.cc:147:33: error: invalid suffix on literal; C++11 requires a space between literal and identifier [-Wreserved-user-defined-literal] Log
cpl-plugin-vimos 3.2.3+dfsg-2vimos_detected_slits.cc:87:46: error: invalid suffix on literal; C++11 requires a space between literal and identifier [-Wreserved-user-defined-literal] Log
crimson 0.5.2-1.1main.cpp:176:31: error: invalid suffix on literal; C++11 requires a space between literal and identifier [-Wreserved-user-defined-literal] Log
crrcsim 0.9.13-3.1src/mod_fdm/fdm_displaymode/../../mod_fdm_config.h:38:36: error: invalid suffix on literal; C++11 requires a space between literal and identifier [-Wreserved-user-defined-literal] Log
dvd+rw-tools 7.1-14dvd+rw-mediainfo.cpp:624:27: error: invalid suffix on literal; C++11 requires a space between literal and identifier [-Wreserved-user-defined-literal] Log
epcr 2.3.12-1-6./fast_seqio_write.cpp:45:43: error: invalid suffix on literal; C++11 requires a space between literal and identifier [-Wreserved-user-defined-literal] Log
espeakedit 1.48.03-5espeakedit.cpp:314:186: error: invalid suffix on literal; C++11 requires a space between literal and identifier [-Wreserved-user-defined-literal] Log
fcml 1.1.3-3../../include/fcml_types.h../../include/fcml_types.h:119:31: error: invalid suffix on literal; C++11 requires a space between literal and identifier [-Wreserved-user-defined-literal] Log
flmsg 2.0.16.01-1blank-dnd/blank.cxx:137:33: error: invalid suffix on literal; C++11 requires a space between literal and identifier [-Wreserved-user-defined-literal] Log
flwrap 1.3.4-2.1flwrap.cxx:550:21: error: invalid suffix on literal; C++11 requires a space between literal and identifier [-Wreserved-user-defined-literal] Log
freemedforms-project 0.9.4-2widgets/filenamevalidatinglineedit.cpp:85:60: error: invalid suffix on literal; C++11 requires a space between literal and identifier [-Wreserved-user-defined-literal] Log
fstransform 0.9.3-2../src/io/io_posix.cc:420:72: error: invalid suffix on literal; C++11 requires a space between literal and identifier [-Wreserved-user-defined-literal] Log
fuse-convmvfs 0.2.6-2convmvfs.cpp:115:32: error: invalid suffix on literal; C++11 requires a space between literal and identifier [-Wreserved-user-defined-literal] Log
gcc-avr 1:5.4.0+Atmel3.6.1-2../../gcc/gcc/config/elfos.h:102:25: error: invalid suffix on literal; C++11 requires a space between literal and identifier [-Wreserved-user-defined-literal] Log
gem 1:0.94~pre1-1:4:32: error: invalid suffix on literal; C++11 requires a space between literal and identifier [-Wreserved-user-defined-literal] Log
gmorgan 0.40-1NotGenerated.cxx:3395:54: error: invalid suffix on literal; C++11 requires a space between literal and identifier [-Wreserved-user-defined-literal] Log
gnubiff 2.2.17-2gnubiff_options.cc:202:19: error: invalid suffix on literal; C++11 requires a space between literal and identifier [-Wreserved-user-defined-literal] Log
gogglesmm 0.12.7-3src/GMAbout.cpp:92:31: error: invalid suffix on literal; C++11 requires a space between literal and identifier [-Wreserved-user-defined-literal] Log
gvidm 0.8-12gvid.cc:99:17: error: invalid suffix on literal; C++11 requires a space between literal and identifier [-Wreserved-user-defined-literal] Log
hashdeep 4.4-5./xml.h:103:82: error: invalid suffix on literal; C++11 requires a space between literal and identifier [-Wreserved-user-defined-literal] Log
ho22bus 0.9.1-2rwconfig.cpp:76:20: error: invalid suffix on literal; C++11 requires a space between literal and identifier [-Wreserved-user-defined-literal] Log
horgand 1.14-7HORGAN.cxx:127:45: error: invalid suffix on literal; C++11 requires a space between literal and identifier [-Wreserved-user-defined-literal] Log
ht 2.1.0+repack1-3../htinfo.h:30:39: error: invalid suffix on literal; C++11 requires a space between literal and identifier [-Wreserved-user-defined-literal] Log
httraqt 1.4.9-1htsglobal.h:211:80: error: invalid suffix on literal; C++11 requires a space between literal and identifier [-Wreserved-user-defined-literal] Log
ibutils 1.5.7+0.2.gbd7e502-2ibissh_wrap.cpp:644:77: error: invalid suffix on literal; C++11 requires a space between literal and identifier [-Wreserved-user-defined-literal] Log
kawari8 8.2.8-8shiori/kawari_shiori.cpp:147:35: error: invalid suffix on literal; C++11 requires a space between literal and identifier [-Wreserved-user-defined-literal] Log
kmer 0~20150903+r2013-6util.h:55:29: error: invalid suffix on literal; C++11 requires a space between literal and identifier [-Wreserved-user-defined-literal] Log
kobodeluxe 0.5.1-10filemap.cpp:854:19: error: invalid suffix on literal; C++11 requires a space between literal and identifier [-Wreserved-user-defined-literal] Log
lensfun 0.3.2-4cpuid.cpp:95:18: error: invalid suffix on literal; C++11 requires a space between literal and identifier [-Wreserved-user-defined-literal] Log
libaqbanking 5.7.8-3hbcixml.cpp:67:37: error: invalid suffix on literal; C++11 requires a space between literal and identifier [-Wreserved-user-defined-literal] Log
libchipcard 5.1.0beta-3cardcommander.cpp:48:47: error: invalid suffix on literal; C++11 requires a space between literal and identifier [-Wreserved-user-defined-literal] Log
libtrace3 3.0.21-1tracetop.cc:380:16: error: invalid suffix on literal; C++11 requires a space between literal and identifier [-Wreserved-user-defined-literal] Log
log4cpp 1.1.3-1testDailyRollingFileAppender.cpp:43:46: error: invalid suffix on literal; C++11 requires a space between literal and identifier [-Wreserved-user-defined-literal] Log
maelstrom 1.4.3-L3.0.6+main-9../load.h:124:65: error: invalid suffix on literal; C++11 requires a space between literal and identifier [-Wreserved-user-defined-literal] Log
mccs 1:1.1-8sources/cudf.c:674:16: error: invalid suffix on literal; C++11 requires a space between literal and identifier [-Wreserved-user-defined-literal] Log
menu 2.1.47update-menus.cc:947:30: error: invalid suffix on literal; C++11 requires a space between literal and identifier [-Wreserved-user-defined-literal] Log
minisapserver 0.3.6-1.1sapserver.cpp:94:33: error: invalid suffix on literal; C++11 requires a space between literal and identifier [-Wreserved-user-defined-literal] Log
minisat+ 1.0-4./SatELite.h:509:56: error: invalid suffix on literal; C++11 requires a space between literal and identifier [-Wreserved-user-defined-literal] Log
minisat2 1:2.2.1-5./minisat/utils/Options.h:285:33: error: invalid suffix on literal; C++11 requires a space between literal and identifier [-Wreserved-user-defined-literal] Log 756336
mp4v2 2.0.0~dfsg0-6src/mp4util.h:36:51: error: invalid suffix on literal; C++11 requires a space between literal and identifier [-Wreserved-user-defined-literal] Log
mrtrix 0.2.13-2lib/file/dicom/select_cmdline.cpp:118:44: error: invalid suffix on literal; C++11 requires a space between literal and identifier [-Wreserved-user-defined-literal] Log
nam 1.15-5tclcl.h:193:33: error: invalid suffix on literal; C++11 requires a space between literal and identifier [-Wreserved-user-defined-literal] Log
ncc 2.8-2.1preproc.C:50:45: error: invalid suffix on literal; C++11 requires a space between literal and identifier [-Wreserved-user-defined-literal] Log
ns2 2.35+dfsg-3tclcl.h:193:33: error: invalid suffix on literal; C++11 requires a space between literal and identifier [-Wreserved-user-defined-literal] Log
octave-sparsersb 1.0.6-2sparsersb.cc:100:49: error: invalid suffix on literal; C++11 requires a space between literal and identifier [-Wreserved-user-defined-literal] Log
open-invaders 0.3-4.3../headers/declare.h:27:41: error: invalid suffix on literal; C++11 requires a space between literal and identifier [-Wreserved-user-defined-literal] Log
openuniverse 1.0beta3.1+dfsg-6scrnshot.cpp:50:37: error: invalid suffix on literal; C++11 requires a space between literal and identifier [-Wreserved-user-defined-literal] Log
pbzip2 1.1.9-1pbzip2.cpp:1271:75: error: invalid suffix on literal; C++11 requires a space between literal and identifier [-Wreserved-user-defined-literal] Log
pcmanx-gtk2 1.3-2mainframe.cpp:190:56: error: invalid suffix on literal; C++11 requires a space between literal and identifier [-Wreserved-user-defined-literal] Log
pinot 1.05-2../Tokenize/filters/GMimeMboxFilter.cc:304:32: error: invalid suffix on literal; C++11 requires a space between literal and identifier [-Wreserved-user-defined-literal] Log
pirs 2.0.2+dfsg-7pirs_diploid.cpp:639:15: error: invalid suffix on literal; C++11 requires a space between literal and identifier [-Wreserved-user-defined-literal] Log
posterazor 1.5.1-2TranslationEnglish.h:121:71: error: invalid suffix on literal; C++11 requires a space between literal and identifier [-Wreserved-user-defined-literal] Log
qjoypad 4.1.0-2.1layout.cpp:160:23: error: invalid suffix on literal; C++11 requires a space between literal and identifier [-Wreserved-user-defined-literal] Log 752125
qt-gstreamer 1.2.0-5basedelegate.cpp:158:53: error: invalid suffix on literal; C++11 requires a space between literal and identifier [-Wreserved-user-defined-literal] Log
rakarrack 0.6.1-5../../src/rakarrack.cxx:851:43: error: invalid suffix on literal; C++11 requires a space between literal and identifier [-Wreserved-user-defined-literal] Log
sdl-ball 1.02-2./menu.cpp:207:47: error: invalid suffix on literal; C++11 requires a space between literal and identifier [-Wreserved-user-defined-literal] Log
seaview 1:4.7-1seaview.cxx:3352:24: error: invalid suffix on literal; C++11 requires a space between literal and identifier [-Wreserved-user-defined-literal] Log
sipxtapi 3.3.0~test17-3utl/UtlString.cpp:735:77: error: invalid suffix on literal; C++11 requires a space between literal and identifier [-Wreserved-user-defined-literal] Log
soprano 2.9.4+dfsg-5pluginmanager.cpp:46:124: error: invalid suffix on literal; C++11 requires a space between literal and identifier [-Wreserved-user-defined-literal] Log
sphinxsearch 2.2.11-2sphinx.cpp:27823:15: error: invalid suffix on literal; C++11 requires a space between literal and identifier [-Wreserved-user-defined-literal] Log
ssm 1.4.0-1superpose.cpp:117:10: error: invalid suffix on literal; C++11 requires a space between literal and identifier [-Wreserved-user-defined-literal] Log
tclcl 1.20-9tclcl.h:193:33: error: invalid suffix on literal; C++11 requires a space between literal and identifier [-Wreserved-user-defined-literal] Log
tcpreen 1.4.4-2main.cpp:111:27: error: invalid suffix on literal; C++11 requires a space between literal and identifier [-Wreserved-user-defined-literal] Log
ufraw 0.22-3.1dcraw.cc:10086:30: error: invalid suffix on literal; C++11 requires a space between literal and identifier [-Wreserved-user-defined-literal] Log
ukopp 4.9-1ukopp-4.9.cc:1277:42: error: invalid suffix on literal; C++11 requires a space between literal and identifier [-Wreserved-user-defined-literal] Log
v4l2ucp 2.0.2-4mainWindow.cpp:300:57: error: invalid suffix on literal; C++11 requires a space between literal and identifier [-Wreserved-user-defined-literal] Log
vdr-plugin-mp3 0.10.2-23data-mp3.c:46:30: error: invalid suffix on literal; C++11 requires a space between literal and identifier [-Wreserved-user-defined-literal] Log
vdr-plugin-xineliboutput 2.1.0-1xine/vo_lastpts.c:86:30: error: invalid suffix on literal; C++11 requires a space between literal and identifier [-Wreserved-user-defined-literal] Log
whitedune 0.30.10-2.1dune1.rc.c:6548:109: error: invalid suffix on literal; C++11 requires a space between literal and identifier [-Wreserved-user-defined-literal] Log
wmcdplay 1.1-2wmcdplay.cc:356:85: error: invalid suffix on literal; C++11 requires a space between literal and identifier [-Wreserved-user-defined-literal] Log
xdelta3 3.0.11-dfsg-1testing/file.h:69:14: error: invalid suffix on literal; C++11 requires a space between literal and identifier [-Wreserved-user-defined-literal] Log
xprobe 0.3-4../defines.h:27:15: error: invalid suffix on literal; C++11 requires a space between literal and identifier [-Wreserved-user-defined-literal] Log
82 errors
Return to the list