Debian Package rebuild

Rebuild of the Debian archive with clang

"Unknown Type Name" build failure(s)
clang 7.0.1
Return to the list
Some type detections are failing or wrong assumptions were made. For example, with strace, old configure are doing some tests on the bool (stdbool.h) declaration but fails on:
conftest.c:84:16: error: initializer element is not a compile-time constant
         int xlcbug = 1 / (&(digs + 5)[-2 + (bool) 1] == &digs[4] ? 1 : -1);
                      ^~~~~~~~~~~~~~~~~~~~~~~~~~~~~~~~~~~~~~~~~~~~~~~~~~~~~
# Provided by the macro AC_HEADER_STDBOOL but removed in recent release of autoconf

Versions: 2.9 - 3.0 - 3.1 - 3.2 - 3.3 - 3.4 - 3.4.2 - 3.5.0 - 3.6.0 - 3.8.1 - 3.9.1 - 4.0.1 - 5.0 - 6.0 - 7.0.1 - 8svn
PackageVersionSupposed error messageFull log Bug report
chromium 72.0.3626.7-6../../content/public/test/browser_test_utils.h:628:24: error: unknown type name 'nullptr_t'; did you mean 'std::nullptr_t'? Log
freebsd-libs 10.3~svn296373-10./libutil.h:62:9: error: unknown type name '__size_t'; did you mean '__ssize_t'? Log
2 errors
Return to the list