Debian Package rebuild

Rebuild of the Debian archive with clang

"Argument unused caused failure" build failure(s)
clang 7.0.1
Return to the list
Unknown or unused arguments triggers errors with -Werror:
clang -Werror -ggdb3 foo.c

Versions: 2.9 - 3.0 - 3.1 - 3.2 - 3.3 - 3.4 - 3.4.2 - 3.5.0 - 3.6.0 - 3.8.1 - 3.9.1 - 4.0.1 - 5.0 - 6.0 - 7.0.1 - 8svn
PackageVersionSupposed error messageFull log Bug report
acpica-unix 20181213-1clang: error: argument unused during compilation: '-pie' [-Werror,-Wunused-command-line-argument] Log
libpsm2 11.2.68-4clang: error: argument unused during compilation: '-specs=/usr/share/dpkg/no-pie-compile.specs' [-Werror,-Wunused-command-line-argument] Log
librdkafka 0.11.6-1.1DBG: compile check for PIC (HAVE_PIC) failed: gcc -g -O2 -fdebug-prefix-map=/<>=. -specs=/usr/share/dpkg/no-pie-compile.specs -fstack-protector-strong -Wformat -Werror=format-security -Wdate-time -D_FORTIFY_SOURCE=2 -I/usr/include -g -O2 -Wall -Werror _mkltmplpkIDt.c -o _mkltmplpkIDt.c.o -specs=/usr/share/dpkg/no-pie-link.specs -Wl,-z,relro -Wl,-z,now -L/usr/lib/x86_64-linux-gnu -fPIC: clang: error: argument unused during compilation: '-specs=/usr/share/dpkg/no-pie-compile.specs' [-Werror,-Wunused-command-line-argument] Log
python-pyxattr 0.6.1-1clang: error: argument unused during compilation: '-specs=/usr/share/dpkg/no-pie-compile.specs' [-Werror,-Wunused-command-line-argument] Log
skiboot 6.1-4clang: error: argument unused during compilation: '-specs=/usr/share/dpkg/no-pie-compile.specs' [-Werror,-Wunused-command-line-argument] Log
sphde 1.4.0-2clang: error: argument unused during compilation: '-mhtm' [-Werror,-Wunused-command-line-argument] Log
6 errors
Return to the list