Debian Package rebuild

Rebuild of the Debian archive with clang

"non-void function should return a value" build failure(s)
clang 8.0.1
Return to the list
With the command
clang -c -Werror plop.c
the code
int myFunction() {
	return;
}
is rejected by clang while accepted with gcc.
Versions: 2.9 - 3.0 - 3.1 - 3.2 - 3.3 - 3.4 - 3.4.2 - 3.5.0 - 3.6.0 - 3.8.1 - 3.9.1 - 4.0.1 - 5.0 - 6.0 - 8.0.1 - 9.0.1 - 10
PackageVersionSupposed error messageFull log Bug report
calculix-ccx 2.11-1u_free.c:44:3: error: non-void function 'u_free' should return a value [-Wreturn-type] Log
dvi2dvi 2.0alpha-10dviconv.c:119:7: error: non-void function 'dviconv' should return a value [-Wreturn-type] Log 741135
dvi2ps 5.1j-1.3virfont.c:320:2: error: non-void function 'vf_mc' should return a value [-Wreturn-type] Log 760387
evolution-rss 0.3.95-11rss.c:4382:2: error: non-void function 'process_attachments' should return a value [-Wreturn-type] Log
gamin 0.1.10-6gam_eq.c:127:3: error: non-void function 'gam_eq_flush' should return a value [-Wreturn-type] Log 743699
gbatnav 1.0.4cvs20051004-5.1play.c:511:3: error: non-void function 'lookup_funcion' should return a value [-Wreturn-type] Log 743696
geki2 2.0.3-10ranking.c:18:5: error: non-void function 'ScoreRanking' should return a value [-Wreturn-type] Log
geki3 1.0.3-8.1ranking.c:18:5: error: non-void function 'ScoreRanking' should return a value [-Wreturn-type] Log
gfpoken 1-2main.c:681:3: error: non-void function 'leveldraw_drag_end' should return a value [-Wreturn-type] Log
glimpse 4.18.7-5misc.c:294:2: error: non-void function 'uninitialize_common' should return a value [-Wreturn-type] Log
gnome-shell-pomodoro 0.16.0-1gnome-shell-extension.c:843:2: error: non-void function 'gnome_plugin_gnome_shell_extension_get_info' should return a value [-Wreturn-type] Log
gtimer 2.0.0-1.2custom-list.c:613:3: error: non-void function 'custom_list_append_record' should return a value [-Wreturn-type] Log 743313
hpsockd 0.17v5.c:162:3: error: non-void function 'v5Request' should return a value [-Wreturn-type] Log
irssi-plugin-robustirc 0.6-4robustsession-network.c:268:9: error: non-void function 'robustsession_network_server' should return a value [-Wreturn-type] Log
kannel-sqlbox 0.7.2-5sqlbox_mssql.c:109:9: error: non-void function 'mssql_fetch_msg' should return a value [-Wreturn-type] Log 742733
latencytop 0.5fsync.c:66:4: error: non-void function 'chain_file' should return a value [-Wreturn-type] Log 760285
ldapvi 1.7-10ldapvi.c:1468:30: error: non-void function 'copy_sasl_output' should return a value [-Wreturn-type] Log 760286
libace-perl 1.92-8RPC.xs:157:6: error: non-void function 'constant' should return a value [-Wreturn-type] Log
libgpiv 0.6.1-7../../lib/io_raw.c:261:5: error: non-void function 'gpiv_fwrite_raw_image' should return a value [-Wreturn-type] Log
libgraphics-libplot-perl 2.2.2-7Libplot.xs:91:6: error: non-void function 'constant' should return a value [-Wreturn-type] Log
libnatpmp 20150609-7libnatpmpmodule.c:273:5: error: non-void function 'initlibnatpmp' should return a value [-Wreturn-type] Log
libpsortb 1.0+dfsg-3std_funcs.c:2471:5: error: non-void function 'update_shares_prior_multi' should return a value [-Wreturn-type] Log
linux86 0.16.17-3.3tok_io.c:231:6: error: non-void function 'do_control' should return a value [-Wreturn-type] Log
loqui 0.6.4-3remark_entry.c:553:2: error: non-void function 'remark_entry_find_completion_matches' should return a value [-Wreturn-type] Log
lwipv6 1.5a-5../../../../ports/unix/netif/vdeif.c:485:3: error: non-void function 'vdeif_streampkt_input' should return a value [-Wreturn-type] Log
mate-settings-daemon 1.24.0-1msd-xrandr-manager.c:2414:3: error: non-void function 'apply_intended_configuration' should return a value [-Wreturn-type] Log
nield 0.6.1-2tcmsg_filter_flow.c:310:5: error: non-void function 'conv_flow_key' should return a value [-Wreturn-type] Log
notify-osd 0.9.35+15.04.20150126-1./display.c:291:2: error: non-void function 'stack_layout' should return a value [-Wreturn-type] Log
openmama 2.2.2.1-12mamajni.c:930:20: error: non-void function 'Java_com_wombat_mama_Mama_getProperty' should return a value [-Wreturn-type] Log
osmo-iuh 0.3.0-5hnb-test.c:329:3: error: non-void function 'hnb_test_nas_rx_auth_req' should return a value [-Wreturn-type] Log
quisk 4.1.52-2charleston/chas_rx2.c:973:5: error: non-void function 'initchas_rx1' should return a value [-Wreturn-type] Log
sdl-mixer1.2 1.2.12-16music_mad.c:227:2: error: non-void function 'mad_getSamples' should return a value [-Wreturn-type] Log 741373
spacearyarya 1.0.2-7.1ranking.c:18:5: error: non-void function 'ScoreRanking' should return a value [-Wreturn-type] Log 812158
tcpspy 1.7d-13tcpspy.c:721:7: error: non-void function 'main' should return a value [-Wreturn-type] Log
ukui-control-center 1.1.6-2gsp-app.c:984:9: error: non-void function 'gsp_app_create' should return a value [-Wreturn-type] Log
uniutils 2.27-2unifuzz.c:109:44: error: non-void function 'EmitAllRanges' should return a value [-Wreturn-type] Log 740968
xcircuit 3.9.73+dfsg.1-1tclxcircuit.c:8950:13: error: non-void function 'defaultscript' should return a value [-Wreturn-type] Log
xgks 2.6.1+dfsg.2-5input.c:209:2: error: non-void function 'XgksIProcessXEvent' should return a value [-Wreturn-type] Log 740871
38 errors
Return to the list