Debian Package rebuild

Rebuild of the Debian archive with clang

"'asm goto' constructs are not supported yet" build failure(s)
clang 8svn
Return to the list

Versions: 2.9 - 3.0 - 3.1 - 3.2 - 3.3 - 3.4 - 3.4.2 - 3.5.0 - 3.6.0 - 3.8.1 - 3.9.1 - 4.0.1 - 5.0 - 6.0 - 7.0.1 - 8svn
PackageVersionSupposed error messageFull log Bug report
libvirt-php 0.5.4-3zend_operators.h:486:10: error: 'asm goto' constructs are not supported yet Log
owfs 3.2p3+dfsg1-2zend_operators.h:486:10: error: 'asm goto' constructs are not supported yet Log
php-amqp 1.9.3-4zend_operators.h:486:10: error: 'asm goto' constructs are not supported yet Log
php-apcu 5.1.16+4.0.11-1zend_operators.h:486:10: error: 'asm goto' constructs are not supported yet Log
php-apcu-bc 1.0.4-3zend_operators.h:486:10: error: 'asm goto' constructs are not supported yet Log
php-ast 0.1.6-2zend_operators.h:486:10: error: 'asm goto' constructs are not supported yet Log
php-ds 1.2.6-2zend_operators.h:486:10: error: 'asm goto' constructs are not supported yet Log
php-excimer 0.1.0~git20181204.9f02079-1zend_operators.h:486:10: error: 'asm goto' constructs are not supported yet Log
php-facedetect 1.1.0+git20170801-2zend_operators.h:486:10: error: 'asm goto' constructs are not supported yet Log
php-gearman 2.0.5+1.1.2-3zend_operators.h:486:10: error: 'asm goto' constructs are not supported yet Log
php-geoip 1.1.1-3zend_operators.h:486:10: error: 'asm goto' constructs are not supported yet Log
php-geos 1.0.0-4zend_operators.h:486:10: error: 'asm goto' constructs are not supported yet Log
php-gmagick 2.0.5~rc1+1.1.7~rc3-3zend_operators.h:486:10: error: 'asm goto' constructs are not supported yet Log
php-gnupg 1.4.0-3zend_operators.h:486:10: error: 'asm goto' constructs are not supported yet Log
php-horde-lz4 1.0.10-4zend_operators.h:486:10: error: 'asm goto' constructs are not supported yet Log
php-igbinary 2.0.7-2zend_operators.h:486:10: error: 'asm goto' constructs are not supported yet Log
php-imagick 3.4.3-4zend_operators.h:486:10: error: 'asm goto' constructs are not supported yet Log
php-lua 2.0.5+1.1.0-3zend_operators.h:486:10: error: 'asm goto' constructs are not supported yet Log
php-luasandbox 3.0.3-1zend_operators.h:486:10: error: 'asm goto' constructs are not supported yet Log
php-mailparse 3.0.3~dev20181093+2.1.7~dev20160128-1zend_operators.h:486:10: error: 'asm goto' constructs are not supported yet Log
php-memcache 3.0.9~20170802.e702b5f-2zend_operators.h:486:10: error: 'asm goto' constructs are not supported yet Log
php-memcached 3.1.3+2.2.0-1zend_operators.h:486:10: error: 'asm goto' constructs are not supported yet Log
php-mongodb 1.5.3-2zend_operators.h:486:10: error: 'asm goto' constructs are not supported yet Log
php-msgpack 2.0.2+0.5.7-6zend_operators.h:486:10: error: 'asm goto' constructs are not supported yet Log
php-oauth 2.0.2+1.2.3-3zend_operators.h:486:10: error: 'asm goto' constructs are not supported yet Log
php-pecl-http 3.2.0+2.6.0-2zend_operators.h:486:10: error: 'asm goto' constructs are not supported yet Log
php-pinba 1.1.0-5zend_operators.h:486:10: error: 'asm goto' constructs are not supported yet Log
php-propro 2.1.0+1.0.2-2zend_operators.h:486:10: error: 'asm goto' constructs are not supported yet Log
php-ps 1.4.1-1zend_operators.h:486:10: error: 'asm goto' constructs are not supported yet Log
php-radius 1.4.0~b1-9zend_operators.h:486:10: error: 'asm goto' constructs are not supported yet Log
php-raphf 2.0.0+1.1.2-4zend_operators.h:486:10: error: 'asm goto' constructs are not supported yet Log
php-redis 4.2.0-1zend_operators.h:486:10: error: 'asm goto' constructs are not supported yet Log
php-rrd 2.0.1+1.1.3-6zend_operators.h:486:10: error: 'asm goto' constructs are not supported yet Log
php-smbclient 0.9.0-3zend_operators.h:486:10: error: 'asm goto' constructs are not supported yet Log
php-solr 2.4.0-7zend_operators.h:486:10: error: 'asm goto' constructs are not supported yet Log
php-ssh2 1.1.2+0.13-4zend_operators.h:486:10: error: 'asm goto' constructs are not supported yet Log
php-stomp 2.0.2+1.0.9-2zend_operators.h:486:10: error: 'asm goto' constructs are not supported yet Log
php-uploadprogress 1.0.3.1-4-g95d8a0f-5zend_operators.h:486:10: error: 'asm goto' constructs are not supported yet Log
php-uuid 1.0.4-7zend_operators.h:486:10: error: 'asm goto' constructs are not supported yet Log
php-yac 2.0.2+0.9.2-4zend_operators.h:486:10: error: 'asm goto' constructs are not supported yet Log
php-yaml 2.0.2+1.3.1-4zend_operators.h:486:10: error: 'asm goto' constructs are not supported yet Log
php-zmq 1.1.3-9zend_operators.h:486:10: error: 'asm goto' constructs are not supported yet Log
remctl 3.15-1zend_operators.h:486:10: error: 'asm goto' constructs are not supported yet Log
sassphp 0.5.16-1zend_operators.h:486:10: error: 'asm goto' constructs are not supported yet Log
tideways 4.1.6-2zend_operators.h:486:10: error: 'asm goto' constructs are not supported yet Log
uwsgi-plugin-php 0.0.3zend_operators.h:486:10: error: 'asm goto' constructs are not supported yet Log
weechat 2.3-1zend_operators.h:486:10: error: 'asm goto' constructs are not supported yet Log
wikidiff2 1.7.3-1zend_operators.h:486:10: error: 'asm goto' constructs are not supported yet Log
xdebug 2.7.0~beta1+2.6.1+2.5.5-2zend_operators.h:486:10: error: 'asm goto' constructs are not supported yet Log
49 errors
Return to the list