Debian Package rebuild

Rebuild of the Debian archive with clang

"Expected declaration (#define missing?)" build failure(s)
clang 8svn
Return to the list

Versions: 2.9 - 3.0 - 3.1 - 3.2 - 3.3 - 3.4 - 3.4.2 - 3.5.0 - 3.6.0 - 3.8.1 - 3.9.1 - 4.0.1 - 5.0 - 6.0 - 7.0.1 - 8svn
PackageVersionSupposed error messageFull log Bug report
acm 5.0-29.2xdr_var_array.c:83:12: error: expected parameter declarator Log 740019
apt 1.8.0~alpha3../test/interactive-helper/libnoprofile.c:19:5: error: expected parameter declarator Log
ats-lang-anairiats 0.2.11-1bool.cats:42:5: error: expected parameter declarator Log
ats2-lang 0.3.11-2./prelude/CATS/bool.cats:42:5: error: expected parameter declarator Log
ccextractor 0.87+ds1-1../src/lib_ccx/utility.h:41:5: error: expected parameter declarator Log
chasen 2.4.5-43print.c:186:16: error: expected parameter declarator Log
crash 7.2.3+real-2./../include/libiberty.h:616:12: error: expected parameter declarator Log
dcap 2.47.12-2./util.h:14:12: error: expected parameter declarator Log 755964
fflas-ffpack 2.3.2-3conftest.cpp:15:4: error: expected unqualified-id Log
fis-gtm 6.3-003A-2aswp.s:24:2: error: expected relocatable expression Log
gtg-trace 0.2-2+dfsg-4C/paje_GTGBasic1_c.c:14:12: error: expected parameter declarator Log
icinga 1.14.2+ds-3./../include/snprintf.h:29:5: error: expected parameter declarator Log
libesmtp 1.0.6-4.3./missing.h:48:5: error: expected parameter declarator Log
libfiu 0.98-2modules/posix.custom.c:445:42: error: expected parameter declarator Log
libqb 1.0.3-2_syslog_override.c:45:6: error: expected parameter declarator Log
mawk 1.3.3-17print.c:85:11: error: expected parameter declarator Log
mtools 4.0.18-2.1mainloop.c:89:15: error: expected ')' Log
nvptx-tools 0.20180301-1./../include/libiberty.h:627:12: error: expected parameter declarator Log
pchar 1.5-4./pc.h:28:15: error: expected identifier Log
sdpa 7.3.11+dfsg-1mexFprintf.c:32:5: error: expected parameter declarator Log
snap-aligner 1.0~beta.18+dfsg-2SNAPLib/AlignerContext.cpp:341:34: error: expected ')' Log
urjtag 0.10+r2007-1.2../../include/libiberty.h:589:12: error: expected parameter declarator Log
visualboyadvance 1.8.0.dfsg-5debugger.cpp:1725:36: error: expected ')' Log
23 errors
Return to the list