Debian Package rebuild

Rebuild of the Debian archive with clang

"Cannot find member in the struct" build failure(s)
clang 9.0.1
Return to the list

Versions: 2.9 - 3.0 - 3.1 - 3.2 - 3.3 - 3.4 - 3.4.2 - 3.5.0 - 3.6.0 - 3.8.1 - 3.9.1 - 4.0.1 - 5.0 - 6.0 - 8.0.1 - 9.0.1 - 10rc2
PackageVersionSupposed error messageFull log Bug report
canu 1.9+dfsg-1stl_algo.h:3445:15: error: no member named 'min_element' in namespace 'std'; did you mean '__cxx1998::min_element'? Log
cgit 1.2.1+git2.18.0-1../filter.c:388:10: error: no member named '__fprintf_chk' in 'struct cgit_filter' Log
gridengine 8.1.9+dfsg-9../libs/gdi/sge_gdi_ctx.c:1054:19: error: no member named '__dprintf_chk' in 'struct sge_csp_path_class_str' Log
libnftnl 1.1.5-1object.c:374:19: error: no member named '__builtin___snprintf_chk' in 'struct obj_ops' Log 755956
mercator 0.3.3-5polygon_intersect.h:667:37: error: no member named 'm_orient' in 'WFMath::Polygon<2>' Log
mgba 0.7.0-1cli-debugger.c:156:23: error: no member named '__printf_chk' in 'struct CLIDebuggerBackend' Log
6 errors
Return to the list