Debian Package rebuild

Rebuild of the Debian archive with clang

"Testsuite is failing with clang" build failure(s)
clang 9.0.1
Return to the list

Versions: 2.9 - 3.0 - 3.1 - 3.2 - 3.3 - 3.4 - 3.4.2 - 3.5.0 - 3.6.0 - 3.8.1 - 3.9.1 - 4.0.1 - 5.0 - 6.0 - 8.0.1 - 9.0.1 - 10rc2
PackageVersionSupposed error messageFull log Bug report
ccache 3.7.7-1dh_auto_test: error: make -j4 test VERBOSE=1 returned exit code 2 Log
eegdev 0.2-4dh_auto_test: error: make -j4 check VERBOSE=1 returned exit code 2 Log
elogind 241.3-1+debian3dh_auto_test: error: cd build && LC_ALL=C.UTF-8 MESON_TESTTHREADS=4 ninja test returned exit code 1 Log
fakechroot 2.19-3.2dh_auto_test: error: make -j4 test VERBOSE=1 returned exit code 2 Log
gtksourceview4 4.4.0-1dh_auto_test: error: cd obj-x86_64-linux-gnu && LC_ALL=C.UTF-8 MESON_TESTTHREADS=4 ninja test returned exit code 1 Log
healpix-cxx 3.60.0-2dh_auto_test: error: make -j4 check VERBOSE=1 returned exit code 2 Log
healpy 1.13.0-1dh_auto_test: error: pybuild --test --test-pytest -i python{version} -p "3.8 3.7" returned exit code 13 Log
ignition-common 1.1.1-1dh_auto_test: error: cd obj-x86_64-linux-gnu && make -j1 test ARGS\+=-j1 returned exit code 2 Log
igraph 0.7.1-4dh_auto_test: error: make -j4 check VERBOSE=1 returned exit code 2 Log
insighttoolkit4 4.13.2-dfsg1-6dh_auto_test: error: cd BUILD && make -j4 test ARGS\+=-j4 returned exit code 2 Log
libapache2-mod-perl2 2.0.11-2dh_auto_test: error: make -j1 test TEST_VERBOSE=1 returned exit code 2 Log
libautovivification-perl 0.18-1dh_auto_test: error: make -j1 test TEST_VERBOSE=1 returned exit code 2 Log
libclass-xsaccessor-perl 1.19-3dh_auto_test: error: make -j4 test TEST_VERBOSE=1 returned exit code 2 Log
libembperl-perl 2.5.0-14dh_auto_test: error: make -j1 test TEST_VERBOSE=1 returned exit code 2 Log
libfcgi-perl 0.79-1dh_auto_test: error: make -j4 test TEST_VERBOSE=1 returned exit code 2 Log
libfile-map-perl 0.66-1dh_auto_test: error: perl Build test --verbose 1 returned exit code 2 Log
libindirect-perl 0.39-1dh_auto_test: error: make -j4 test TEST_VERBOSE=1 returned exit code 2 Log
libmawk 1.0.2-2dh_auto_test: error: make -j4 test VERBOSE=1 returned exit code 2 Log
libnet-ssleay-perl 1.88-2dh_auto_test: error: make -j4 test TEST_VERBOSE=1 returned exit code 2 Log
libquvi 0.9.3-1.3dh_auto_test: error: make -j1 test VERBOSE=1 returned exit code 2 Log
libscope-upper-perl 0.32-1dh_auto_test: error: make -j4 test TEST_VERBOSE=1 returned exit code 2 Log
libset-object-perl 1.40-1dh_auto_test: error: make -j4 test TEST_VERBOSE=1 returned exit code 2 Log
libsyntax-keyword-dynamically-perl 0.03-1dh_auto_test: error: perl Build test --verbose 1 returned exit code 255 Log
libvariable-magic-perl 0.62-1dh_auto_test: error: make -j1 test TEST_VERBOSE=1 returned exit code 2 Log
libvirt-dbus 1.3.0-1dh_auto_test: error: make -j4 check VERBOSE=1 returned exit code 2 Log
libzstd 1.4.4+dfsg-3dh_auto_test: error: make -j4 test returned exit code 2 Log
paexec 1.1.1-1dh_auto_test: error: mkcmake PREFIX=/usr MANDIR=/usr/share/man INFODIR=/usr/share/info SYSCONFDIR=/etc LIBDIR=/usr/lib/x86_64-linux-gnu LIBEXECDIR=/usr/lib/x86_64-linux-gnu test returned exit code 1 Log
pixman 0.36.0-1dh_auto_test: error: cd build && make -j4 check VERBOSE=1 VERBOSE=1 returned exit code 2 Log
pykdtree 1.3.1-4dh_auto_test: error: pybuild --test --test-nose -i python{version} -p "3.8 3.7" returned exit code 13 Log
rust-assert-cli 0.6.3-2dh_auto_test: error: /usr/share/cargo/bin/cargo build returned exit code 101 Log
rust-backtrace 0.3.44-2dh_auto_test: error: /usr/share/cargo/bin/cargo test --all returned exit code 101 Log
rust-backtrace-sys 0.1.32-2dh_auto_test: error: /usr/share/cargo/bin/cargo build returned exit code 101 Log
rust-debcargo 2.4.2-1dh_auto_test: error: /usr/share/cargo/bin/cargo test --all returned exit code 101 Log
rust-error-chain 0.12.0-1dh_auto_test: error: /usr/share/cargo/bin/cargo build returned exit code 101 Log
rust-rustfix 0.4.6-1dh_auto_test: error: /usr/share/cargo/bin/cargo build returned exit code 101 Log
rust-sloppy-rfc4880 0.1.5-2dh_auto_test: error: /usr/share/cargo/bin/cargo build returned exit code 101 Log
rust-syslog 4.0.1-2dh_auto_test: error: /usr/share/cargo/bin/cargo build returned exit code 101 Log
siconos 4.2.0+git20181026.0ee5349+dfsg.2-2dh_auto_test: error: cd obj-x86_64-linux-gnu && make -j1 test "ARGS=-E 'fc3d__NSN_AC_Tol_1e-5_Max_1000_inTol_0_inMax_0_IPARAM_1_Capsules-i100-1090|fc3d__NSN_AC_TEST_Tol_1e-5_Max_1000_inTol_0_inMax_0_IPARAM_1_Capsules-i101-404|fc3d__NSN_AC_TEST_Tol_1e-3_Max_1000_inTol_0_inMax_0_Capsules-i101-404|fc3d__ADMM_Tol_1e-08_Max_100000_inTol_0_inMax_0_IPARAM_SICONOS_FRICTION_3D_ADMM_RHO_STRATEGY_RESIDUAL_BALANCING_LMGC_100_PR_PerioBox-i00361-60-03000.hdf5|fc3d__ADMM_Tol_1e-08_Max_100000_inTol_0_inMax_0_IPARAM_SICONOS_FRICTION_3D_ADMM_RHO_STRATEGY_RESIDUAL_BALANCING_SICONOS_FRICTION_3D_ADMM_FORCED_SPARSE_STORAGE_LMGC_100_PR_PerioBox-i00361-60-03000.hdf5|gfc3d__NSN_AC_Tol_0_Max_0_inTol_0_inMax_0_LMGC_GFC3D_CubeH8.hdf5|gfc3d__NSN_AC_Tol_1e-14_Max_0_inTol_0_inMax_0_LMGC_GFC3D-i00501-4-00000.hdf5|TwistingTest::test_ExplicitTwisting_Lsodar'" ARGS\+=-j1 returned exit code 2 Log
trilinos 12.14.1-2dh_auto_test: error: cd obj-x86_64-linux-gnu && make -j4 test ARGS\+=-j4 returned exit code 2 Log
udisks2 2.8.4-1dh_auto_test: error: make -j4 check VERBOSE=1 returned exit code 2 Log
umockdev 0.14.1-1dh_auto_test: error: make -j4 check VERBOSE=1 returned exit code 2 Log
41 errors
Return to the list