Debian Package rebuild

Rebuild of the Debian archive with clang

"Redefinition failed" build failure(s)
clang 2.9
Return to the list

Versions: 2.9 - 3.0 - 3.1 - 3.2 - 3.3 - 3.4 - 3.4.2 - 3.5.0 - 3.6.0 - 3.8.1 - 3.9.1 - 4.0.1 - 5.0
PackageVersionSupposed error messageFull log Bug report
dynare 4.2.1-2ModelTree.cc:805:43: error: redefinition of 'it' with a different type Log
freebsd-buildutils 8.2-7stdio.h:80:20: error: redefinition of typedef 'va_list' is invalid in C [-Wtypedef-redefinition] Log
freebsd-libs 8.2+ds1-4stdio.h:80:20: error: redefinition of typedef 'va_list' is invalid in C [-Wtypedef-redefinition] Log
fstrcmp 0.3.D001-1lib/ac/string.c:57:22: error: redefinition of 'sys_errlist' with a different type Log
ghostscript 9.02~dfsg-3./base/time_.h:49:8: error: redefinition of 'timeval' Log
gtkmathview 0.8.0-7../../../src/frontend/common/TemplateBuilder.hh:54:42: error: redefinition of 'elem' Log
hexxagon 1.0pl1-3gtkhexxagonboard.cpp:141:17: error: redefinition of 'x' Log
hfsprogs 332.25-9./SRuntime.h:68:23: error: redefinition of typedef 'uint8_t' is invalid in C [-Wtypedef-redefinition] Log
kaffeine 1.2.2-1dvbepg.cpp:702:21: error: redefinition of 'entry' with a different type Log
libterralib 4.0.0-3../../../src/terralib/kernel/TeNetwork.cpp:329:86: error: redefinition of default argument Log 746608
libxbase 2.0.0-8.4dumprecs.cpp:80:10: error: redefinition of 'i' Log 748819
monkeystudio 1.8.4.0-3widgets/pEnvironmentVariablesModel.cpp:195:40: error: redefinition of 'variable' with a different type Log
plink 1.07-1sets.cpp:771:37: error: redefinition of 'i' with a different type Log
pommed 1.39~dfsg-1fcntl.h:172:8: error: redefinition of 'flock' Log
prips 0.9.9-1stdio.h:80:20: error: redefinition of typedef 'va_list' is invalid in C [-Wtypedef-redefinition] Log
sslsniff 0.8-1SSLConnectionManager.cpp:98:17: error: redefinition of 'error' with a different type Log
subversion 1.6.17dfsg-1swig_ruby_external_runtime.swg:1047:14: error: redefinition of '_mSWIG' Log
xmoto 0.5.5-1xmscene/GhostTrail.cpp:87:11: error: redefinition of 'i' with a different type Log
18 errors
Return to the list