Debian Package rebuild

Rebuild of the Debian archive with clang

"Implicit instantiation" build failure(s)
clang 3.2
Return to the list

Versions: 2.9 - 3.0 - 3.1 - 3.2 - 3.3 - 3.4 - 3.4.2 - 3.5.0 - 3.6.0 - 3.8.1
PackageVersionSupposed error messageFull log Bug report
blitz++ 1:0.10-1../blitz/array/expr.h:111:26: error: implicit instantiation of undefined template 'blitz::FastTV2Iterator' Log
ginkgocadx 2.12.0.4889-1idicom.h:199:23: error: implicit instantiation of undefined template 'std::basic_stringstream, std::allocator >' Log
minisat+ 1.0-2ADTs/Global.h:281:43: error: implicit instantiation of undefined template 'STATIC_ASSERTION_FAILURE' Log
3 errors
Return to the list