Debian Package rebuild

Rebuild of the Debian archive with clang

"Forward declaration of class cannot have a nested name specifier" build failure(s)
clang 3.3
Return to the list

Versions: 2.9 - 3.0 - 3.1 - 3.2 - 3.3 - 3.4 - 3.4.2 - 3.5.0 - 3.6.0 - 3.8.1
PackageVersionSupposed error messageFull log Bug report
enemylines3 1.2-7./generators/generators.h:2:7: error: forward declaration of class cannot have a nested name specifier Log
geotranz 3.2-1../../GEOTRANS3/java_gui/geotrans3/jni/JNICCSObjectTranslator.h:14:7: error: forward declaration of class cannot have a nested name specifier Log
granule 1.4.0-7-1./GrappConf.h:31:7: error: forward declaration of class cannot have a nested name specifier Log
pfstools 1.8.5-1./picture_io.h:9:7: error: forward declaration of class cannot have a nested name specifier Log
referencer 1.2.1-1./RefWindow.h:23:7: error: forward declaration of class cannot have a nested name specifier Log
sipxtapi 3.3.0~test9-1../../../../sipXportLib/src/test/sipxunit/TestOutputter.h:18:7: error: forward declaration of class cannot have a nested name specifier Log
6 errors
Return to the list