Debian Package rebuild

Rebuild of the Debian archive with clang

"Variable length array for a non POD (plain old data) element" build failure(s)
clang 3.4.2
Return to the list
The following code is not (and won't) supported by clang.
#include <vector>

void foo() {
    int N=2;
    std::vector<int> best[2][N];
}

Versions: 2.9 - 3.0 - 3.1 - 3.2 - 3.3 - 3.4 - 3.4.2 - 3.5.0 - 3.6.0 - 3.8.1
PackageVersionSupposed error messageFull log Bug report
adolc 2.5.0-3sparsedrivers.cpp:1142:11: error: variable length array of non-POD element type 'adtl::adouble' Log 752121
apertium 3.1.0-2hmm.cc:730:23: error: variable length array of non-POD element type 'vector' Log 748976
beignet 0.8-1gen_insn_selection.cpp:2404:22: error: variable length array of non-POD element type 'gbe::GenRegister' Log 750380
ceph 0.80.1-1key_value_store/kv_flat_btree_async.cc:1123:40: error: variable length array of non-POD element type 'librados::ObjectWriteOperation' Log 749083
disulfinder 1.2.11-3Input/buildXfolds.cpp:16:41: error: variable length array of non-POD element type 'std::vector' Log
extrema 4.4.5.dfsg-3AxisPopup.cpp:217:19: error: variable length array of non-POD element type 'wxString' Log 742158
fte 0.50.2b6-1con_linux.cpp:434:12: error: variable length array of non-POD element type 'TCell' Log 749086
handlersocket 1.1.0-7-g1044a28-1.1HandlerSocket.xs:525:19: error: variable length array of non-POD element type 'execute_arg' Log 749088
idba 1.1.1-2../src/tools/parallel_rna_blat.cpp:64:24: error: variable length array of non-POD element type 'FastaWriter' Log 752122
jellyfish 1.1.11-1./jellyfish/invertible_hash_array.hpp:639:31: error: variable length array of non-POD element type 'jellyfish::invertible_hash::array::prefetch_info' Log 749136
maitreya 7.0.5-1Painter.cpp:331:11: error: variable length array of non-POD element type 'wxPoint' Log 753056
musescore 1.3+dfsg-2rendermidi.cpp:559:36: error: variable length array of non-POD element type 'QList' Log 752124
pfstmo 1.4-1display_adaptive_tmo.cpp:743:26: error: variable length array of non-POD element type 'UniformArrayLUT' Log 749156
qelectrotech 0.22+svn897-1:514:16: error: variable length array of non-POD element type 'QPointF' Log 749158
qjoypad 4.1.0-1layout_edit.cpp:42:18: error: variable length array of non-POD element type 'QString' Log 752125
scim 1.4.14-6scim_helper_manager_server.cpp:98:24: error: variable length array of non-POD element type 'scim::HelperModule' Log 750115
simutrans 111.2.2-1freight_list_sorter.cc:114:2: error: variable length array of non-POD element type 'ware_t' Log 750121
steghide 0.5.1-9BmpFile.cc:217:44: error: variable length array of non-POD element type 'std::vector' Log 750123
18 errors
Return to the list