Debian Package rebuild

Rebuild of the Debian archive with clang

"Some files are gone in the process" build failure(s)
clang 10.0.0
Return to the list

Versions: 2.9 - 3.0 - 3.1 - 3.2 - 3.3 - 3.4 - 3.4.2 - 3.5.0 - 3.6.0 - 3.8.1 - 3.9.1 - 4.0.1 - 5.0 - 6.0 - 8.0.1 - 9.0.1 - 10.0.0 - 11.0.0
PackageVersionSupposed error messageFull log Bug report
cxref 1.6e-3mv: cannot stat 'README.c.tex': No such file or directory Log
evolution-data-server 3.36.2-1/<>/obj-x86_64-linux-gnu/src/libedataserverui/tmp-introspectakc_jat5/EDataServerUI-1.2: error while loading shared libraries: libebackend-1.2.so.10: cannot open shared object file: No such file or directory Log
freeipmi 1.6.4-3clang: error: no such file or directory: 'libfreeipmi.3' Log
glib2.0 2.64.2-1 result = 0, error = Error removing file /<>/debian/build/deb/testdir_live-g-file/dir_no-execute/file: No such file or directory Log
kst 2.0.8-3clang: error: no such file or directory: '/Yc/<>/obj-x86_64-linux-gnu/src/libkst/kstcore_pch.h' Log
libdeflate 1.5-3: Could not read profile default.profdata: No such file or directory Log
libselinux 3.0-1clang: error: no such file or directory: 'temp.aux' Log
libsemanage 3.0-1clang: error: no such file or directory: 'temp.aux' Log
libsrtp2 2.3.0-4./rtpw: error while loading shared libraries: libsrtp2.so.1: cannot open shared object file: No such file or directory Log
ncl 6.6.2-1clang: error: no such file or directory: '1' Log
octave-interval 3.2.0-5chmod: cannot access 'debian/*/usr/lib/*/octave/packages/*/*/*.mex': No such file or directory Log
opencascade 7.4.1+dfsg1-2Failed to copy 'usr/bin/custom_gcc_64.sh': No such file or directory at /usr/share/dh-exec/dh-exec-install-rename line 51, <> line 3. Log
perl 5.30.0-10Can't open gnu/stubs-x32.h: No such file or directory Log
13 errors
Return to the list