Debian Package rebuild

Rebuild of the Debian archive with clang

"Some files are gone in the process" build failure(s)
clang 8.0.1
Return to the list

Versions: 2.9 - 3.0 - 3.1 - 3.2 - 3.3 - 3.4 - 3.4.2 - 3.5.0 - 3.6.0 - 3.8.1 - 3.9.1 - 4.0.1 - 5.0 - 6.0 - 8.0.1 - 9.0.1 - 10
PackageVersionSupposed error messageFull log Bug report
cxref 1.6e-3mv: cannot stat 'README.c.tex': No such file or directory Log
gcc-m68hc1x 1:3.3.6+3.1+dfsg-3.1cp: cannot create regular file '/usr/m68hc11/sys-include/_inst.19761_': No such file or directory Log
glib2.0 2.62.4-2 result = 0, error = Error removing file /<>/debian/build/deb/testdir_live-g-file/dir_no-execute/file: No such file or directory Log
kst 2.0.8-3clang: error: no such file or directory: '/Yc/<>/obj-x86_64-linux-gnu/src/libkst/kstcore_pch.h' Log
libboost-geometry-utils-perl 0.15-2Can't exec "clang++": No such file or directory at /usr/share/perl/5.30/ExtUtils/CBuilder/Base.pm line 342. Log
libdeflate 1.5-3: Could not read profile default.profdata: No such file or directory Log
libmath-clipper-perl 1.29-1Can't exec "clang++": No such file or directory at /usr/share/perl/5.30/ExtUtils/CBuilder/Base.pm line 342. Log
libsemanage 3.0-1clang: error: no such file or directory: 'temp.aux' Log
libsrtp2 2.3.0-2./rtpw: error while loading shared libraries: libsrtp2.so.1: cannot open shared object file: No such file or directory Log
ncl 6.6.2-1clang: error: no such file or directory: '1' Log
perl 5.30.0-9Can't open gnu/stubs-x32.h: No such file or directory Log
slic3r 1.3.0+dfsg1-3Can't exec "clang++": No such file or directory at /usr/share/perl/5.30/ExtUtils/CBuilder/Base.pm line 342. Log
12 errors
Return to the list