Debian Package rebuild

Rebuild of the Debian archive with clang

"Incorrect range loop construct" build failure(s)
clang 10.0.0
Return to the list

Versions: 2.9 - 3.0 - 3.1 - 3.2 - 3.3 - 3.4 - 3.4.2 - 3.5.0 - 3.6.0 - 3.8.1 - 3.9.1 - 4.0.1 - 5.0 - 6.0 - 8.0.1 - 9.0.1 - 10.0.0 - 11.0.0
PackageVersionSupposed error messageFull log Bug report
cataclysm-dda 0.E-2src/advanced_inv.cpp:855:38: error: loop variable 'elem' of type 'const advanced_inv_listitem' creates a copy from type 'const advanced_inv_listitem' [-Werror,-Wrange-loop-construct] Log
cbmc 5.12-4./language_file.h:87:54: error: loop variable 'method' has type 'const std::pair &' (aka 'const pair &') but is initialized with type 'std::pair' resulting in a copy [-Werror,-Wrange-loop-construct] Log
intel-compute-runtime 20.13.16352-1program_info_from_patchtokens.cpp:21:21: error: loop variable 'kernel' of type 'const NEO::PatchTokenBinary::KernelFromPatchtokens' creates a copy from type 'const NEO::PatchTokenBinary::KernelFromPatchtokens' [-Werror,-Wrange-loop-construct] Log
wlcs 1.1.0+dfsg-4xfail_supporting_test_listener.cpp:173:25: error: loop variable 'name' of type 'const std::__cxx11::basic_string' creates a copy from type 'const std::__cxx11::basic_string' [-Werror,-Wrange-loop-construct] Log
4 errors
Return to the list