Debian Package rebuild

Rebuild of the Debian archive with clang

"C++11 requires a space between literal and identifier" build failure(s)
clang 10.0.0
Return to the list

Versions: 2.9 - 3.0 - 3.1 - 3.2 - 3.3 - 3.4 - 3.4.2 - 3.5.0 - 3.6.0 - 3.8.1 - 3.9.1 - 4.0.1 - 5.0 - 6.0 - 8.0.1 - 9.0.1 - 10.0.0 - 11.0.0
PackageVersionSupposed error messageFull log Bug report
abiword 3.0.2-10ap_UnixApp.cpp:866:29: error: invalid suffix on literal; C++11 requires a space between literal and identifier [-Wreserved-user-defined-literal] Log
aranym 1.0.2-2.2./src/Unix/linux/ethernet_linux.cpp:98:34: error: invalid suffix on literal; C++11 requires a space between literal and identifier [-Wreserved-user-defined-literal] Log
berusky 1.7.1-1./defines.h:448:43: error: invalid suffix on literal; C++11 requires a space between literal and identifier [-Wreserved-user-defined-literal] Log
bidentd 1.1.4-1.2main.cc:244:38: error: invalid suffix on literal; C++11 requires a space between literal and identifier [-Wreserved-user-defined-literal] Log
boinc-app-seti 8.00~svn4035-1../sah_config.h:784:40: error: invalid suffix on literal; C++11 requires a space between literal and identifier [-Wreserved-user-defined-literal] Log
coinor-ipopt 3.11.9-2.2IpIpoptAlg.cpp:265:69: error: invalid suffix on literal; C++11 requires a space between literal and identifier [-Wreserved-user-defined-literal] Log
collatinus 11-1src/mainwindow.cpp:356:19: error: invalid suffix on literal; C++11 requires a space between literal and identifier [-Wreserved-user-defined-literal] Log
comptext 1.0.1-4main.cxx:189:21: error: invalid suffix on literal; C++11 requires a space between literal and identifier [-Wreserved-user-defined-literal] Log
crimson 0.5.2-1.1main.cpp:176:31: error: invalid suffix on literal; C++11 requires a space between literal and identifier [-Wreserved-user-defined-literal] Log
crrcsim 0.9.13-3.2src/mod_fdm/fdm_displaymode/../../mod_fdm_config.h:38:36: error: invalid suffix on literal; C++11 requires a space between literal and identifier [-Wreserved-user-defined-literal] Log
dvd+rw-tools 7.1-14dvd+rw-mediainfo.cpp:624:27: error: invalid suffix on literal; C++11 requires a space between literal and identifier [-Wreserved-user-defined-literal] Log
epcr 2.3.12-1-8./fast_seqio_write.cpp:45:43: error: invalid suffix on literal; C++11 requires a space between literal and identifier [-Wreserved-user-defined-literal] Log
espeakedit 1.48.03-7espeakedit.cpp:314:186: error: invalid suffix on literal; C++11 requires a space between literal and identifier [-Wreserved-user-defined-literal] Log
fractalnow 0.8.2-4src/command_line.cpp:109:62: error: invalid suffix on literal; C++11 requires a space between literal and identifier [-Wreserved-user-defined-literal] Log
fuse-convmvfs 0.2.6-2convmvfs.cpp:115:32: error: invalid suffix on literal; C++11 requires a space between literal and identifier [-Wreserved-user-defined-literal] Log
gcc-avr 1:5.4.0+Atmel3.6.1-2../../gcc/gcc/config/elfos.h:102:25: error: invalid suffix on literal; C++11 requires a space between literal and identifier [-Wreserved-user-defined-literal] Log
gem 1:0.94-1:4:32: error: invalid suffix on literal; C++11 requires a space between literal and identifier [-Wreserved-user-defined-literal] Log
gnubiff 2.2.17-2gnubiff_options.cc:202:19: error: invalid suffix on literal; C++11 requires a space between literal and identifier [-Wreserved-user-defined-literal] Log
gogglesmm 0.12.7-3src/GMAbout.cpp:92:31: error: invalid suffix on literal; C++11 requires a space between literal and identifier [-Wreserved-user-defined-literal] Log
hashdeep 4.4-6./xml.h:103:82: error: invalid suffix on literal; C++11 requires a space between literal and identifier [-Wreserved-user-defined-literal] Log
horgand 1.14-7HORGAN.cxx:127:45: error: invalid suffix on literal; C++11 requires a space between literal and identifier [-Wreserved-user-defined-literal] Log
ht 2.1.0+repack1-3../htinfo.h:30:39: error: invalid suffix on literal; C++11 requires a space between literal and identifier [-Wreserved-user-defined-literal] Log
httraqt 1.4.9-1htsglobal.h:211:80: error: invalid suffix on literal; C++11 requires a space between literal and identifier [-Wreserved-user-defined-literal] Log
ibutils 1.5.7+0.2.gbd7e502-2ibissh_wrap.cpp:644:77: error: invalid suffix on literal; C++11 requires a space between literal and identifier [-Wreserved-user-defined-literal] Log
kawari8 8.2.8-10shiori/kawari_shiori.cpp:147:35: error: invalid suffix on literal; C++11 requires a space between literal and identifier [-Wreserved-user-defined-literal] Log
kcheckers 0.8.1-5pdn.cc:350:27: error: invalid suffix on literal; C++11 requires a space between literal and identifier [-Wreserved-user-defined-literal] Log
kmer 0~20150903+r2013-7util.h:55:29: error: invalid suffix on literal; C++11 requires a space between literal and identifier [-Wreserved-user-defined-literal] Log
kobodeluxe 0.5.1-10filemap.cpp:854:19: error: invalid suffix on literal; C++11 requires a space between literal and identifier [-Wreserved-user-defined-literal] Log
lensfun 0.3.2-5cpuid.cpp:95:18: error: invalid suffix on literal; C++11 requires a space between literal and identifier [-Wreserved-user-defined-literal] Log
libchipcard 5.1.5rc2-4cardcommander.cpp:48:47: error: invalid suffix on literal; C++11 requires a space between literal and identifier [-Wreserved-user-defined-literal] Log
libcommoncpp2 1.8.1-8nat.cpp:148:29: error: invalid suffix on literal; C++11 requires a space between literal and identifier [-Wreserved-user-defined-literal] Log 756438
libtrace3 3.0.21-1tracetop.cc:380:16: error: invalid suffix on literal; C++11 requires a space between literal and identifier [-Wreserved-user-defined-literal] Log
log4cpp 1.1.3-1testDailyRollingFileAppender.cpp:43:46: error: invalid suffix on literal; C++11 requires a space between literal and identifier [-Wreserved-user-defined-literal] Log
maelstrom 1.4.3-L3.0.6+main-9../load.h:124:65: error: invalid suffix on literal; C++11 requires a space between literal and identifier [-Wreserved-user-defined-literal] Log
mccs 1:1.1-8sources/cudf.c:674:16: error: invalid suffix on literal; C++11 requires a space between literal and identifier [-Wreserved-user-defined-literal] Log
menu 2.1.47update-menus.cc:947:30: error: invalid suffix on literal; C++11 requires a space between literal and identifier [-Wreserved-user-defined-literal] Log
minisapserver 0.3.6-1.1sapserver.cpp:94:33: error: invalid suffix on literal; C++11 requires a space between literal and identifier [-Wreserved-user-defined-literal] Log
minisat+ 1.0-4./SatELite.h:509:56: error: invalid suffix on literal; C++11 requires a space between literal and identifier [-Wreserved-user-defined-literal] Log
minisat2 1:2.2.1-5./minisat/utils/Options.h:285:33: error: invalid suffix on literal; C++11 requires a space between literal and identifier [-Wreserved-user-defined-literal] Log 756336
mrtrix 0.2.13-2lib/file/dicom/select_cmdline.cpp:118:44: error: invalid suffix on literal; C++11 requires a space between literal and identifier [-Wreserved-user-defined-literal] Log
nam 1.15-5tclcl.h:193:33: error: invalid suffix on literal; C++11 requires a space between literal and identifier [-Wreserved-user-defined-literal] Log
ns2 2.35+dfsg-3tclcl.h:193:33: error: invalid suffix on literal; C++11 requires a space between literal and identifier [-Wreserved-user-defined-literal] Log
octave-sparsersb 1.0.6-3sparsersb.cc:100:49: error: invalid suffix on literal; C++11 requires a space between literal and identifier [-Wreserved-user-defined-literal] Log
open-invaders 0.3-5../headers/declare.h:27:41: error: invalid suffix on literal; C++11 requires a space between literal and identifier [-Wreserved-user-defined-literal] Log
openuniverse 1.0beta3.1+dfsg-6scrnshot.cpp:50:37: error: invalid suffix on literal; C++11 requires a space between literal and identifier [-Wreserved-user-defined-literal] Log
pbzip2 1.1.13-1pbzip2.cpp:1223:75: error: invalid suffix on literal; C++11 requires a space between literal and identifier [-Wreserved-user-defined-literal] Log
pcmanx-gtk2 1.3-2mainframe.cpp:190:56: error: invalid suffix on literal; C++11 requires a space between literal and identifier [-Wreserved-user-defined-literal] Log
phantomjs 2.1.1+dfsg-2webpage.cpp:80:89: error: invalid suffix on literal; C++11 requires a space between literal and identifier [-Wreserved-user-defined-literal] Log
pirs 2.0.2+dfsg-8pirs_diploid.cpp:639:15: error: invalid suffix on literal; C++11 requires a space between literal and identifier [-Wreserved-user-defined-literal] Log
posterazor 1.5.1-2TranslationEnglish.h:121:71: error: invalid suffix on literal; C++11 requires a space between literal and identifier [-Wreserved-user-defined-literal] Log
rakarrack 0.6.1-5../../src/rakarrack.cxx:851:43: error: invalid suffix on literal; C++11 requires a space between literal and identifier [-Wreserved-user-defined-literal] Log
sdl-ball 1.02-2./menu.cpp:207:47: error: invalid suffix on literal; C++11 requires a space between literal and identifier [-Wreserved-user-defined-literal] Log
seaview 1:4.7-1seaview.cxx:3352:24: error: invalid suffix on literal; C++11 requires a space between literal and identifier [-Wreserved-user-defined-literal] Log
sipxtapi 3.3.0~test17-3.1utl/UtlString.cpp:735:77: error: invalid suffix on literal; C++11 requires a space between literal and identifier [-Wreserved-user-defined-literal] Log
speech-dispatcher 0.9.1-5./module_utils.h:125:63: error: invalid suffix on literal; C++11 requires a space between literal and identifier [-Wreserved-user-defined-literal] Log
sphinxsearch 2.2.11-2sphinx.cpp:27823:15: error: invalid suffix on literal; C++11 requires a space between literal and identifier [-Wreserved-user-defined-literal] Log
ssm 1.4.0-1superpose.cpp:117:10: error: invalid suffix on literal; C++11 requires a space between literal and identifier [-Wreserved-user-defined-literal] Log
tclcl 1.20-9tclcl.h:193:33: error: invalid suffix on literal; C++11 requires a space between literal and identifier [-Wreserved-user-defined-literal] Log
tcpreen 1.4.4-2main.cpp:111:27: error: invalid suffix on literal; C++11 requires a space between literal and identifier [-Wreserved-user-defined-literal] Log
uim 1:1.8.8-6.1main.cpp:68:55: error: invalid suffix on literal; C++11 requires a space between literal and identifier [-Wreserved-user-defined-literal] Log
ukopp 4.9-1ukopp-4.9.cc:1277:42: error: invalid suffix on literal; C++11 requires a space between literal and identifier [-Wreserved-user-defined-literal] Log
vdr-plugin-mp3 0.10.2-25data-mp3.c:46:30: error: invalid suffix on literal; C++11 requires a space between literal and identifier [-Wreserved-user-defined-literal] Log
whitedune 0.30.10-2.2dune1.rc.c:6548:109: error: invalid suffix on literal; C++11 requires a space between literal and identifier [-Wreserved-user-defined-literal] Log
wmcdplay 1.1-2wmcdplay.cc:356:85: error: invalid suffix on literal; C++11 requires a space between literal and identifier [-Wreserved-user-defined-literal] Log
xdelta3 3.0.11-dfsg-1testing/file.h:69:14: error: invalid suffix on literal; C++11 requires a space between literal and identifier [-Wreserved-user-defined-literal] Log
xprobe 0.3-4../defines.h:27:15: error: invalid suffix on literal; C++11 requires a space between literal and identifier [-Wreserved-user-defined-literal] Log
66 errors
Return to the list