Debian Package rebuild

Rebuild of the Debian archive with clang

"C++11 requires a space between literal and identifier" build failure(s)
clang 6.0
Return to the list

Versions: 2.9 - 3.0 - 3.1 - 3.2 - 3.3 - 3.4 - 3.4.2 - 3.5.0 - 3.6.0 - 3.8.1 - 3.9.1 - 4.0.1 - 5.0 - 6.0
PackageVersionSupposed error messageFull log Bug report
amule 1:2.3.2-2../../../../src/webserver/src/php_syntree.cpp:929:53: error: invalid suffix on literal; C++11 requires a space between literal and identifier [-Wreserved-user-defined-literal] Log
aranym 1.0.2-2.2./src/Unix/linux/ethernet_linux.cpp:98:34: error: invalid suffix on literal; C++11 requires a space between literal and identifier [-Wreserved-user-defined-literal] Log
audex 0.79-1profilemodel.h:47:30: error: invalid suffix on literal; C++11 requires a space between literal and identifier [-Wreserved-user-defined-literal] Log
berusky 1.7.1-1./defines.h:448:43: error: invalid suffix on literal; C++11 requires a space between literal and identifier [-Wreserved-user-defined-literal] Log
bidentd 1.1.4-1.1main.cc:244:38: error: invalid suffix on literal; C++11 requires a space between literal and identifier [-Wreserved-user-defined-literal] Log
bochs 2.6-5dbg_main.cc:1058:28: error: invalid suffix on literal; C++11 requires a space between literal and identifier [-Wreserved-user-defined-literal] Log
boinc-app-seti 8.00~svn3701-1../sah_config.h:778:40: error: invalid suffix on literal; C++11 requires a space between literal and identifier [-Wreserved-user-defined-literal] Log
cclive 0.9.3-0.1./cc/options.h:750:44: error: invalid suffix on literal; C++11 requires a space between literal and identifier [-Wreserved-user-defined-literal] Log
coinor-ipopt 3.11.9-2.1IpIpoptAlg.cpp:265:69: error: invalid suffix on literal; C++11 requires a space between literal and identifier [-Wreserved-user-defined-literal] Log
comptext 1.0.1-2main.cxx:189:21: error: invalid suffix on literal; C++11 requires a space between literal and identifier [-Wreserved-user-defined-literal] Log
comptty 1.0.1-2main.cxx:189:21: error: invalid suffix on literal; C++11 requires a space between literal and identifier [-Wreserved-user-defined-literal] Log
cpl-plugin-fors 5.3.32+dfsg-1fors_detected_slits.cc:87:46: error: invalid suffix on literal; C++11 requires a space between literal and identifier [-Wreserved-user-defined-literal] Log
cpl-plugin-vimos 3.2.3+dfsg-1vimos_detected_slits.cc:87:46: error: invalid suffix on literal; C++11 requires a space between literal and identifier [-Wreserved-user-defined-literal] Log
crimson 0.5.2-1.1main.cpp:176:31: error: invalid suffix on literal; C++11 requires a space between literal and identifier [-Wreserved-user-defined-literal] Log
crrcsim 0.9.12-6.2mod_fdm_config.h:38:36: error: invalid suffix on literal; C++11 requires a space between literal and identifier [-Wreserved-user-defined-literal] Log
dvd+rw-tools 7.1-12dvd+rw-mediainfo.cpp:624:27: error: invalid suffix on literal; C++11 requires a space between literal and identifier [-Wreserved-user-defined-literal] Log
epcr 2.3.12-1-5./fast_seqio_write.cpp:45:43: error: invalid suffix on literal; C++11 requires a space between literal and identifier [-Wreserved-user-defined-literal] Log
espeakedit 1.48.03-5espeakedit.cpp:314:186: error: invalid suffix on literal; C++11 requires a space between literal and identifier [-Wreserved-user-defined-literal] Log
fcml 1.1.3-2../../include/fcml_types.h:116:30: error: invalid suffix on literal; C++11 requires a space between literal and identifier [-Wreserved-user-defined-literal] Log
flmsg 2.0.16.01-1blank-dnd/blank.cxx:137:33: error: invalid suffix on literal; C++11 requires a space between literal and identifier [-Wreserved-user-defined-literal] Log
flrig 1.3.26-1main.cxx:474:21: error: invalid suffix on literal; C++11 requires a space between literal and identifier [-Wreserved-user-defined-literal] Log
flwrap 1.3.4-2.1flwrap.cxx:550:21: error: invalid suffix on literal; C++11 requires a space between literal and identifier [-Wreserved-user-defined-literal] Log
freemedforms-project 0.9.4-2widgets/filenamevalidatinglineedit.cpp:85:60: error: invalid suffix on literal; C++11 requires a space between literal and identifier [-Wreserved-user-defined-literal] Log
fstransform 0.9.3-2../src/io/io_posix.cc:420:72: error: invalid suffix on literal; C++11 requires a space between literal and identifier [-Wreserved-user-defined-literal] Log
fuse-convmvfs 0.2.6-2convmvfs.cpp:115:32: error: invalid suffix on literal; C++11 requires a space between literal and identifier [-Wreserved-user-defined-literal] Log
gcc-avr 1:5.4.0+Atmel3.6.0-1../../gcc/gcc/config/elfos.h:102:25: error: invalid suffix on literal; C++11 requires a space between literal and identifier [-Wreserved-user-defined-literal] Log
gfan 0.5+dfsg-6app_interactive.cpp:250:21: error: invalid suffix on literal; C++11 requires a space between literal and identifier [-Wreserved-user-defined-literal] Log 755308
ggcov 0.9-20cov.C:626:34: error: invalid suffix on literal; C++11 requires a space between literal and identifier [-Wreserved-user-defined-literal] Log
gmorgan 0.40-1NotGenerated.cxx:3395:54: error: invalid suffix on literal; C++11 requires a space between literal and identifier [-Wreserved-user-defined-literal] Log
gogglesmm 0.12.7-3src/GMAbout.cpp:92:31: error: invalid suffix on literal; C++11 requires a space between literal and identifier [-Wreserved-user-defined-literal] Log
gvidm 0.8-12gvid.cc:99:17: error: invalid suffix on literal; C++11 requires a space between literal and identifier [-Wreserved-user-defined-literal] Log
hashdeep 4.4-4./xml.h:103:82: error: invalid suffix on literal; C++11 requires a space between literal and identifier [-Wreserved-user-defined-literal] Log
ho22bus 0.9.1-2rwconfig.cpp:76:20: error: invalid suffix on literal; C++11 requires a space between literal and identifier [-Wreserved-user-defined-literal] Log
horgand 1.14-7HORGAN.cxx:127:45: error: invalid suffix on literal; C++11 requires a space between literal and identifier [-Wreserved-user-defined-literal] Log
ht 2.1.0+repack1-3../htinfo.h:30:39: error: invalid suffix on literal; C++11 requires a space between literal and identifier [-Wreserved-user-defined-literal] Log
httraqt 1.4.9-1htsglobal.h:211:80: error: invalid suffix on literal; C++11 requires a space between literal and identifier [-Wreserved-user-defined-literal] Log
ibutils 1.5.7+0.2.gbd7e502-1ibissh_wrap.cpp:644:77: error: invalid suffix on literal; C++11 requires a space between literal and identifier [-Wreserved-user-defined-literal] Log
kawari8 8.2.8-8shiori/kawari_shiori.cpp:147:35: error: invalid suffix on literal; C++11 requires a space between literal and identifier [-Wreserved-user-defined-literal] Log
kde4libs 4:4.14.36-1kiconcache.cpp:106:68: error: invalid suffix on literal; C++11 requires a space between literal and identifier [-Wreserved-user-defined-literal] Log
kmer 0~20150903+r2013-3util.h:55:29: error: invalid suffix on literal; C++11 requires a space between literal and identifier [-Wreserved-user-defined-literal] Log
kobodeluxe 0.5.1-8filemap.cpp:854:19: error: invalid suffix on literal; C++11 requires a space between literal and identifier [-Wreserved-user-defined-literal] Log
le 1.16.3-1cmd.cc:35:29: error: invalid suffix on literal; C++11 requires a space between literal and identifier [-Wreserved-user-defined-literal] Log
lensfun 0.3.2-4cpuid.cpp:95:18: error: invalid suffix on literal; C++11 requires a space between literal and identifier [-Wreserved-user-defined-literal] Log
libaqbanking 5.7.8-1hbcixml.cpp:67:37: error: invalid suffix on literal; C++11 requires a space between literal and identifier [-Wreserved-user-defined-literal] Log
libchipcard 5.1.0beta-2cardcommander.cpp:48:47: error: invalid suffix on literal; C++11 requires a space between literal and identifier [-Wreserved-user-defined-literal] Log
libtrace3 3.0.21-1tracetop.cc:380:16: error: invalid suffix on literal; C++11 requires a space between literal and identifier [-Wreserved-user-defined-literal] Log
llvm-toolchain-4.0 1:4.0.1-10GDBRemoteCommunication.cpp:43:48: error: invalid suffix on literal; C++11 requires a space between literal and identifier [-Wreserved-user-defined-literal] Log
llvm-toolchain-snapshot 1:7~svn327768-1GDBRemoteCommunication.cpp:43:48: error: invalid suffix on literal; C++11 requires a space between literal and identifier [-Wreserved-user-defined-literal] Log
maelstrom 1.4.3-L3.0.6+main-9../load.h:124:65: error: invalid suffix on literal; C++11 requires a space between literal and identifier [-Wreserved-user-defined-literal] Log
mccs 1:1.1-7sources/cudf.c:674:16: error: invalid suffix on literal; C++11 requires a space between literal and identifier [-Wreserved-user-defined-literal] Log
med-fichier 3.0.6-12MED231champRefInfoEtRenMaabuilt.cxx:98:121: error: invalid suffix on literal; C++11 requires a space between literal and identifier [-Wreserved-user-defined-literal] Log 751174
menu 2.1.47update-menus.cc:947:30: error: invalid suffix on literal; C++11 requires a space between literal and identifier [-Wreserved-user-defined-literal] Log
minisapserver 0.3.6-1.1sapserver.cpp:94:33: error: invalid suffix on literal; C++11 requires a space between literal and identifier [-Wreserved-user-defined-literal] Log
minisat+ 1.0-4./SatELite.h:509:56: error: invalid suffix on literal; C++11 requires a space between literal and identifier [-Wreserved-user-defined-literal] Log
minisat2 1:2.2.1-5./minisat/utils/Options.h:285:33: error: invalid suffix on literal; C++11 requires a space between literal and identifier [-Wreserved-user-defined-literal] Log 756336
mp4v2 2.0.0~dfsg0-6./src/mp4util.h:36:51: error: invalid suffix on literal; C++11 requires a space between literal and identifier [-Wreserved-user-defined-literal] Log
mrtrix 0.2.12-2.1lib/file/dicom/select_cmdline.cpp:118:44: error: invalid suffix on literal; C++11 requires a space between literal and identifier [-Wreserved-user-defined-literal] Log
nam 1.15-4tclcl.h:193:33: error: invalid suffix on literal; C++11 requires a space between literal and identifier [-Wreserved-user-defined-literal] Log
ncc 2.8-2.1preproc.C:50:45: error: invalid suffix on literal; C++11 requires a space between literal and identifier [-Wreserved-user-defined-literal] Log
ns2 2.35+dfsg-2.1tclcl.h:193:33: error: invalid suffix on literal; C++11 requires a space between literal and identifier [-Wreserved-user-defined-literal] Log
octave-sparsersb 1.0.5-3sparsersb.cc:100:49: error: invalid suffix on literal; C++11 requires a space between literal and identifier [-Wreserved-user-defined-literal] Log
open-invaders 0.3-4.3../headers/declare.h:27:41: error: invalid suffix on literal; C++11 requires a space between literal and identifier [-Wreserved-user-defined-literal] Log
openuniverse 1.0beta3.1+dfsg-6scrnshot.cpp:50:37: error: invalid suffix on literal; C++11 requires a space between literal and identifier [-Wreserved-user-defined-literal] Log
partimage 0.6.9-6common.cpp:275:41: error: invalid suffix on literal; C++11 requires a space between literal and identifier [-Wreserved-user-defined-literal] Log
pbzip2 1.1.9-1pbzip2.cpp:1271:75: error: invalid suffix on literal; C++11 requires a space between literal and identifier [-Wreserved-user-defined-literal] Log
pcmanx-gtk2 1.3-1mainframe.cpp:190:56: error: invalid suffix on literal; C++11 requires a space between literal and identifier [-Wreserved-user-defined-literal] Log
percona-xtrabackup 2.2.3-2.1univ.i:445:22: error: invalid suffix on literal; C++11 requires a space between literal and identifier [-Wreserved-user-defined-literal] Log
pinot 1.05-1.2../Tokenize/filters/GMimeMboxFilter.cc:304:32: error: invalid suffix on literal; C++11 requires a space between literal and identifier [-Wreserved-user-defined-literal] Log
pirs 2.0.2+dfsg-6pirs_diploid.cpp:639:15: error: invalid suffix on literal; C++11 requires a space between literal and identifier [-Wreserved-user-defined-literal] Log
posterazor 1.5.1-2TranslationEnglish.h:121:71: error: invalid suffix on literal; C++11 requires a space between literal and identifier [-Wreserved-user-defined-literal] Log
qjoypad 4.1.0-2.1layout.cpp:160:23: error: invalid suffix on literal; C++11 requires a space between literal and identifier [-Wreserved-user-defined-literal] Log 752125
rakarrack 0.6.1-4../../src/rakarrack.cxx:851:43: error: invalid suffix on literal; C++11 requires a space between literal and identifier [-Wreserved-user-defined-literal] Log
sdl-ball 1.02-2./menu.cpp:207:47: error: invalid suffix on literal; C++11 requires a space between literal and identifier [-Wreserved-user-defined-literal] Log
seaview 1:4.6.5-1xfmatpt.cxx:208:87: error: invalid suffix on literal; C++11 requires a space between literal and identifier [-Wreserved-user-defined-literal] Log
sipxtapi 3.3.0~test17-3utl/UtlString.cpp:735:77: error: invalid suffix on literal; C++11 requires a space between literal and identifier [-Wreserved-user-defined-literal] Log
sleuthkit 4.6.0-1sigfind.cpp:305:52: error: invalid suffix on literal; C++11 requires a space between literal and identifier [-Wreserved-user-defined-literal] Log
soprano 2.9.4+dfsg-5pluginmanager.cpp:46:124: error: invalid suffix on literal; C++11 requires a space between literal and identifier [-Wreserved-user-defined-literal] Log
sphinxsearch 2.2.11-2sphinx.cpp:27823:15: error: invalid suffix on literal; C++11 requires a space between literal and identifier [-Wreserved-user-defined-literal] Log
ssm 1.3-2.2superpose.cpp:81:10: error: invalid suffix on literal; C++11 requires a space between literal and identifier [-Wreserved-user-defined-literal] Log
stardict 3.0.1-9.4pluginmanager.cpp:68:33: error: invalid suffix on literal; C++11 requires a space between literal and identifier [-Wreserved-user-defined-literal] Log
stardict-tools 3.0.2-6lib_stardict_bin2text.cpp:351:56: error: invalid suffix on literal; C++11 requires a space between literal and identifier [-Wreserved-user-defined-literal] Log
swfmill 0.3.3-1swfmill.cpp:25:7: error: invalid suffix on literal; C++11 requires a space between literal and identifier [-Wreserved-user-defined-literal] Log
tclcl 1.20-8tclcl.h:193:33: error: invalid suffix on literal; C++11 requires a space between literal and identifier [-Wreserved-user-defined-literal] Log
tcpreen 1.4.4-2main.cpp:111:27: error: invalid suffix on literal; C++11 requires a space between literal and identifier [-Wreserved-user-defined-literal] Log
thrift-compiler 0.9.1-2.1src/thrifty.yy:664:42: error: invalid suffix on literal; C++11 requires a space between literal and identifier [-Wreserved-user-defined-literal] Log
tripwire 2.4.3.1-2twstrings.cpp:255:108: error: invalid suffix on literal; C++11 requires a space between literal and identifier [-Wreserved-user-defined-literal] Log
ufraw 0.22-3dcraw.cc:10079:30: error: invalid suffix on literal; C++11 requires a space between literal and identifier [-Wreserved-user-defined-literal] Log
v4l2ucp 2.0.2-4mainWindow.cpp:300:57: error: invalid suffix on literal; C++11 requires a space between literal and identifier [-Wreserved-user-defined-literal] Log
vdr-plugin-mp3 0.10.2-23data-mp3.c:46:30: error: invalid suffix on literal; C++11 requires a space between literal and identifier [-Wreserved-user-defined-literal] Log
vdr-plugin-xineliboutput 2.1.0-1xine/vo_lastpts.c:86:30: error: invalid suffix on literal; C++11 requires a space between literal and identifier [-Wreserved-user-defined-literal] Log
whitedune 0.30.10-2.1dune1.rc.c:6548:109: error: invalid suffix on literal; C++11 requires a space between literal and identifier [-Wreserved-user-defined-literal] Log
wmcdplay 1.1-2wmcdplay.cc:356:85: error: invalid suffix on literal; C++11 requires a space between literal and identifier [-Wreserved-user-defined-literal] Log
xdelta3 3.0.11-dfsg-1testing/file.h:69:14: error: invalid suffix on literal; C++11 requires a space between literal and identifier [-Wreserved-user-defined-literal] Log
xprobe 0.3-3../defines.h:27:15: error: invalid suffix on literal; C++11 requires a space between literal and identifier [-Wreserved-user-defined-literal] Log
94 errors
Return to the list