Debian Package rebuild

Rebuild of the Debian archive with clang

"Cannot be narrowed" build failure(s)
clang 6.0
Return to the list

Versions: 2.9 - 3.0 - 3.1 - 3.2 - 3.3 - 3.4 - 3.4.2 - 3.5.0 - 3.6.0 - 3.8.1 - 3.9.1 - 4.0.1 - 5.0 - 6.0
PackageVersionSupposed error messageFull log Bug report
achilles 2-9opengl.cc:103:28: error: non-constant-expression cannot be narrowed from type 'double' to 'GLfloat' (aka 'float') in initializer list [-Wc++11-narrowing] Log
aewm++-goodies 1.0-10appbar.cc:1142:21: error: non-constant-expression cannot be narrowed from type 'int' to 'CARD32' (aka 'unsigned int') in initializer list [-Wc++11-narrowing] Log
ale 0.9.0.3-3./d3/focus.h:78:15: error: non-constant-expression cannot be narrowed from type 'unsigned int' to 'int' in initializer list [-Wc++11-narrowing] Log
amoebax 0.2.1+dfsg-3NewHighScoreState.cxx:399:30: error: non-constant-expression cannot be narrowed from type 'int' to 'char' in initializer list [-Wc++11-narrowing] Log
amphetamine 0.8.10-19src/Element.cpp:282:25: error: type 'double' cannot be narrowed to 'short' in initializer list [-Wc++11-narrowing] Log
antigrav 0.0.3-7terrain.cpp:490:51: error: non-constant-expression cannot be narrowed from type 'double' to 'float' in initializer list [-Wc++11-narrowing] Log
asc 2.6.1.0-3pgbutton.cpp:129:8: error: case value evaluates to 2147483655, which cannot be narrowed to type 'int' [-Wc++11-narrowing] Log
audiofile 0.3.6-4Sign.cpp:160:39: error: non-constant-expression cannot be narrowed from type 'int32_t' (aka 'int') to 'uint32_t' (aka 'unsigned int') in initializer list [-Wc++11-narrowing] Log
balder2d 1.0-2src/entity.cpp:50:24: error: non-constant-expression cannot be narrowed from type 'int' to 'Sint16' (aka 'short') in initializer list [-Wc++11-narrowing] Log
bastet 0.43-4Ui.cpp:174:18: error: non-constant-expression cannot be narrowed from type 'unsigned long' to 'int' in initializer list [-Wc++11-narrowing] Log
bist 0.5.2-1.1gruppo.cpp:1407:35: error: non-constant-expression cannot be narrowed from type 'int' to 'double' in initializer list [-Wc++11-narrowing] Log
blackbox 0.70.1-36EWMH.cc:250:7: error: non-constant-expression cannot be narrowed from type 'long' to 'unsigned long' in initializer list [-Wc++11-narrowing] Log
blobandconquer 1.11-dfsg+20-1.1src/hud/dialogs.cpp:124:27: error: non-constant-expression cannot be narrowed from type 'int' to 'Uint16' (aka 'unsigned short') in initializer list [-Wc++11-narrowing] Log
blocks-of-the-undead 1.0-6CSurface.cpp:468:55: error: non-constant-expression cannot be narrowed from type 'Sint16' (aka 'short') to 'Uint16' (aka 'unsigned short') in initializer list [-Wc++11-narrowing] Log
botan1.10 1.10.17-0.1src/ssl/rec_wri.cpp:266:22: error: non-constant-expression cannot be narrowed from type 'Botan::Alert_Level' to 'Botan::byte' (aka 'unsigned char') in initializer list [-Wc++11-narrowing] Log
brainparty 0.61+dfsg-3BPGame.cpp:1506:25: error: non-constant-expression cannot be narrowed from type 'int' to 'GLfloat' (aka 'float') in initializer list [-Wc++11-narrowing] Log
briquolo 0.5.7-8MOGL_PoliceTTF.cpp:346:23: error: non-constant-expression cannot be narrowed from type 'unsigned int' to 'Sint16' (aka 'short') in initializer list [-Wc++11-narrowing] Log
capi4hylafax 1:01.03.00.99.svn.300-20BasicFax.cpp:348:18: error: case value evaluates to -1, which cannot be narrowed to type 'tUInt' (aka 'unsigned int') [-Wc++11-narrowing] Log
ceferino 0.97.8+svn37-2juego.cc:119:24: error: non-constant-expression cannot be narrowed from type 'int' to 'Uint16' (aka 'unsigned short') in initializer list [-Wc++11-narrowing] Log
clanlib 1.0~svn3827-7graphic_context.cpp:240:3: error: non-constant-expression cannot be narrowed from type 'unsigned int' to 'unsigned char' in initializer list [-Wc++11-narrowing] Log
clucene-core 2.3.3.4+dfsg-1QueryParser.cpp:82:176: error: constant expression evaluates to 2147483648 which cannot be narrowed to type 'int32_t' (aka 'int') [-Wc++11-narrowing] Log
cmtk 3.3.1-1.2vtkxform.cxx:190:24: error: non-constant-expression cannot be narrowed from type 'double' to 'float' in initializer list [-Wc++11-narrowing] Log
coin3 3.1.4~abc9f50+dfsg3-2SoOffscreenRenderer.cpp:1739:29: error: non-constant-expression cannot be narrowed from type 'unsigned int' to 'int' in initializer list [-Wc++11-narrowing] Log
concavity 0.1+dfsg.1-1R2Grid.C:2325:37: error: non-constant-expression cannot be narrowed from type 'int' to 'unsigned int' in initializer list [-Wc++11-narrowing] Log
connectome-workbench 1.2.3+git41-gc4c6c90-2AnnotationOneDimensionalShape.cxx:285:9: error: non-constant-expression cannot be narrowed from type 'double' to 'float' in initializer list [-Wc++11-narrowing] Log
critterding 1.0-beta12.1-1.3BulletSoftBody/btSoftBodyHelpers.cpp:288:23: error: non-constant-expression cannot be narrowed from type 'unsigned int' to 'int' in initializer list [-Wc++11-narrowing] Log
desmume 0.9.11-3gfx3d.cpp:1218:3: error: non-constant-expression cannot be narrowed from type 'int' to 'u8' (aka 'unsigned char') in initializer list [-Wc++11-narrowing] Log
dnprogs 2.65connection.cc:932:23: error: non-constant-expression cannot be narrowed from type 'int' to 'char' in initializer list [-Wc++11-narrowing] Log
dosbox 0.74-4.3dos_programs.cpp:70:20: error: non-constant-expression cannot be narrowed from type 'int' to 'char' in initializer list [-Wc++11-narrowing] Log
einstein 2.0.dfsg.2-9screen.cpp:119:32: error: non-constant-expression cannot be narrowed from type 'int' to 'Uint16' (aka 'unsigned short') in initializer list [-Wc++11-narrowing] Log
entropybroker 2.9-1main.cpp:196:24: error: non-constant-expression cannot be narrowed from type 'int' to 'rlim_t' (aka 'unsigned long') in initializer list [-Wc++11-narrowing] Log
eris 1.3.23-6PollDefault.cpp:80:28: error: non-constant-expression cannot be narrowed from type 'unsigned long' to '__time_t' (aka 'long') in initializer list [-Wc++11-narrowing] Log
extundelete 0.2.4-1extundelete.cc:1271:28: error: non-constant-expression cannot be narrowed from type 'int' to 'ext2_ino_t' (aka 'unsigned int') in initializer list [-Wc++11-narrowing] Log
fastml 3.1-3computeCorrelations.cpp:1347:36: error: non-constant-expression cannot be narrowed from type 'double' to 'float' in initializer list [-Wc++11-narrowing] Log
fig2sxd 0.20-1zipwrite.cpp:91:32: error: non-constant-expression cannot be narrowed from type 'int' to 'unsigned char' in initializer list [-Wc++11-narrowing] Log
flatzebra 0.1.6-4../../src/flatzebra/GameEngine.h:412:23: error: non-constant-expression cannot be narrowed from type 'int' to 'Sint16' (aka 'short') in initializer list [-Wc++11-narrowing] Log
fltk1.1 1.1.10-25menubar.cxx:139:28: error: non-constant-expression cannot be narrowed from type 'Fl_Labeltype' to 'uchar' (aka 'unsigned char') in initializer list [-Wc++11-narrowing] Log 755228
ftgl 2.1.3~rc5-4+nmu1.2simple.cpp:108:27: error: non-constant-expression cannot be narrowed from type 'double' to 'float' in initializer list [-Wc++11-narrowing] Log
geoip 1.6.12-1debian/src/geoip-csv-to-dat.cpp:658:4: error: non-constant-expression cannot be narrowed from type 'unsigned long' to 'uint8_t' (aka 'unsigned char') in initializer list [-Wc++11-narrowing] Log
ghemical 3.0.0-3filetrans.cpp:361:5: error: non-constant-expression cannot be narrowed from type 'double' to 'fGL' (aka 'float') in initializer list [-Wc++11-narrowing] Log 756440
giac 1.2.3.57+dfsg1-2solve.cc:5701:23: error: non-constant-expression cannot be narrowed from type 'int' to 'short' in initializer list [-Wc++11-narrowing] Log
gmetadom 0.2.6-7./../include/GdomeSmartDOMTraits.hh:102:25: error: non-constant-expression cannot be narrowed from type 'std::char_traits::int_type' (aka 'unsigned long') to 'std::char_traits::char_type' (aka 'unsigned short') in initializer list [-Wc++11-narrowing] Log
golly 2.8-1../gui-wx/configure/../../gui-wx/wxrender.cpp:161:9: error: non-constant-expression cannot be narrowed from type 'int' to 'GLfloat' (aka 'float') in initializer list [-Wc++11-narrowing] Log
gpick 0.2.5+git20161221-1source/transformation/ColorVisionDeficiency.cpp:122:3: error: non-constant-expression cannot be narrowed from type 'double' to 'float' in initializer list [-Wc++11-narrowing] Log
grfcodec 6.0.6-1src/command.cpp:306:8: error: case value evaluates to -1, which cannot be narrowed to type 'uint' (aka 'unsigned int') [-Wc++11-narrowing] Log
gsmlib 1.10+20120414.gita5e5ae9a-0.3gsm_me_ta.cc:994:45: error: non-constant-expression cannot be narrowed from type 'int' to 'unsigned char' in initializer list [-Wc++11-narrowing] Log
gtkmathview 0.8.0-15GdomeSmartDOMTraits.hh:102:25: error: non-constant-expression cannot be narrowed from type 'std::char_traits::int_type' (aka 'unsigned long') to 'std::char_traits::char_type' (aka 'unsigned short') in initializer list [-Wc++11-narrowing] Log
hex-a-hop 1.1.0+git20140926-1text.cpp:153:18: error: non-constant-expression cannot be narrowed from type 'int' to 'Sint16' (aka 'short') in initializer list [-Wc++11-narrowing] Log
hyphy 2.2.7+dfsg-1HYPlatformComponent.cpp:259:29: error: non-constant-expression cannot be narrowed from type 'long' to 'gint' (aka 'int') in initializer list [-Wc++11-narrowing] Log
icedtea-web 1.6.2-3.1IcedTeaPluginUtils.cc:1020:29: error: non-constant-expression cannot be narrowed from type 'std::__cxx11::basic_string, std::allocator >::size_type' (aka 'unsigned long') to 'uint32_t' (aka 'unsigned int') in initializer list [-Wc++11-narrowing] Log
itksnap 3.6.0-2SliceWindowInteractionDelegateWidget.cxx:126:30: error: non-constant-expression cannot be narrowed from type 'unsigned int' to 'GLint' (aka 'int') in initializer list [-Wc++11-narrowing] Log
k3d 0.8.0.6-6seed_rng.hpp:143:35: error: non-constant-expression cannot be narrowed from type 'int' to 'unsigned int' in initializer list [-Wc++11-narrowing] Log
kcm-fcitx 0.5.5-1skinpage.cpp:134:10: error: case value evaluates to 2401319027, which cannot be narrowed to type 'int' [-Wc++11-narrowing] Log
kino 1.3.4-2.4page_capture.cc:1649:12: error: non-constant-expression cannot be narrowed from type 'unsigned long' to '__syscall_slong_t' (aka 'long') in initializer list [-Wc++11-narrowing] Log
kmplayer 1:0.12.0b-2viewarea.cpp:2538:57: error: non-constant-expression cannot be narrowed from type 'long' to 'uint32_t' (aka 'unsigned int') in initializer list [-Wc++11-narrowing] Log
kopete 4:17.08.3-1chatnavservicetask.cpp:108:24: error: non-constant-expression cannot be narrowed from type 'ChatNavServiceTask::RequestType' to 'Oscar::WORD' (aka 'unsigned short') in initializer list [-Wc++11-narrowing] Log
kytea 0.4.6+dfsg-2string-util.cpp:273:25: error: non-constant-expression cannot be narrowed from type 'kytea::KyteaChar' (aka 'unsigned short') to 'char' in initializer list [-Wc++11-narrowing] Log
latd 1.35llogin.cc:231:25: error: non-constant-expression cannot be narrowed from type 'int' to 'char' in initializer list [-Wc++11-narrowing] Log
libghemical 3.0.0-4.2utility.cpp:308:21: error: non-constant-expression cannot be narrowed from type 'i32u' (aka 'unsigned int') to 'i32s' (aka 'int') in initializer list [-Wc++11-narrowing] Log
libgltf 0.1.0-3Shaders.cpp:131:13: error: non-constant-expression cannot be narrowed from type 'size_t' (aka 'unsigned long') to 'GLint' (aka 'int') in initializer list [-Wc++11-narrowing] Log
libraw 0.18.8-2src/../internal/libraw_x3f.cpp:1404:19: error: non-constant-expression cannot be narrowed from type 'int' to 'int16_t' (aka 'short') in initializer list [-Wc++11-narrowing] Log
libretro-gambatte 0.5.0+git20160522+dfsg1-1src/statesaver.cpp:277:43: error: non-constant-expression cannot be narrowed from type 'unsigned int' to 'unsigned char' in initializer list [-Wc++11-narrowing] Log
libsbml 5.16.0+dfsg-2TranslateSBML.cpp:580:23: error: non-constant-expression cannot be narrowed from type 'unsigned int' to 'mwSize' (aka 'int') in initializer list [-Wc++11-narrowing] Log
libtuxcap 1.4.0.dfsg2-2.3MemoryImage.cpp:1508:21: error: non-constant-expression cannot be narrowed from type 'int' to 'float' in initializer list [-Wc++11-narrowing] Log
meshlab 1.3.2+dfsg1-4downloader.cpp:686:23: error: non-constant-expression cannot be narrowed from type 'unsigned char' to 'char' in initializer list [-Wc++11-narrowing] Log
metview 5.0.1-2Event.cc:38:22: error: non-constant-expression cannot be narrowed from type 'long' to 'int' in initializer list [-Wc++11-narrowing] Log
netgen 4.9.13.dfsg-11mvdraw.cpp:747:28: error: non-constant-expression cannot be narrowed from type 'double' to 'GLfloat' (aka 'float') in initializer list [-Wc++11-narrowing] Log
numptyphysics 0.2+svn157-0.3Canvas.cpp:457:26: error: non-constant-expression cannot be narrowed from type 'int' to 'Sint16' (aka 'short') in initializer list [-Wc++11-narrowing] Log
omniorb-dfsg 4.1.6-2.2../../../../src/lib/omnithread/posix.cc:170:23: error: non-constant-expression cannot be narrowed from type 'unsigned long' to '__time_t' (aka 'long') in initializer list [-Wc++11-narrowing] Log
opal 3.10.10~dfsg2-2.1speexcodec.cxx:783:64: error: non-constant-expression cannot be narrowed from type 'int' to 'unsigned int' in initializer list [-Wc++11-narrowing] Log
openni 1.5.4.0-14../../../../../Wrappers/OpenNI.jni/org_OpenNI_NativeMethods.cpp:971:24: error: non-constant-expression cannot be narrowed from type 'jbyte' (aka 'signed char') to 'XnUInt8' (aka 'unsigned char') in initializer list [-Wc++11-narrowing] Log
p7zip 16.02+dfsg-6../../../../CPP/Windows/ErrorMsg.cpp:24:10: error: case value evaluates to -2147024809, which cannot be narrowed to type 'DWORD' (aka 'unsigned int') [-Wc++11-narrowing] Log
pcsc-cyberjack 3.99.5final.sp09-1.1ifd.cpp:968:8: error: case value evaluates to 3221225653, which cannot be narrowed to type 'CJ_RESULT' (aka 'int') [-Wc++11-narrowing] Log
pekwm 0.1.17-3ActionHandler.cc:620:10: error: case value evaluates to 4294967294, which cannot be narrowed to type 'int' [-Wc++11-narrowing] Log
pgadmin3 1.22.2-4frm/frmEditGrid.cpp:2405:10: error: case value evaluates to -42, which cannot be narrowed to type 'OID' (aka 'unsigned long') [-Wc++11-narrowing] Log
pkcs11-dump 0.3.4-1.1pkcs11-dump.cpp:1139:6: error: non-constant-expression cannot be narrowed from type 'int' to 'CK_ATTRIBUTE_TYPE' (aka 'unsigned long') in initializer list [-Wc++11-narrowing] Log
pong2 0.1.3-2Framework.cpp:270:23: error: non-constant-expression cannot be narrowed from type 'double' to 'GLfloat' (aka 'float') in initializer list [-Wc++11-narrowing] Log
primrose 6+dfsg1-4Panel.cpp:211:13: error: non-constant-expression cannot be narrowed from type 'int' to 'GLfloat' (aka 'float') in initializer list [-Wc++11-narrowing] Log
procinfo 1:2.0.304-3./lib/timeRoutines.cpp:134:38: error: non-constant-expression cannot be narrowed from type 'uint32_t' (aka 'unsigned int') to 'int' in initializer list [-Wc++11-narrowing] Log
projectm 2.1.0+dfsg-4VideoEcho.cpp:80:30: error: non-constant-expression cannot be narrowed from type 'double' to 'float' in initializer list [-Wc++11-narrowing] Log
python-cffi 1.11.5-1_CFFI_test_verify_anonymous_struct_with_star_typedef.cpp:506:10: error: non-constant-expression cannot be narrowed from type 'long' to 'size_t' (aka 'unsigned long') in initializer list [-Wc++11-narrowing] Log
python-visual 1:5.12-1.6render_surface.cpp:116:21: error: non-constant-expression cannot be narrowed from type 'unsigned int' to 'bool' in initializer list [-Wc++11-narrowing] Log
qtiplot 0.9.8.9-17src/qwt3d_lighting.cpp:178:27: error: non-constant-expression cannot be narrowed from type 'double' to 'GLfloat' (aka 'float') in initializer list [-Wc++11-narrowing] Log
raidutils 0.0.6-22command.cpp:1670:7: error: non-constant-expression cannot be narrowed from type 'int' to 'uCHAR' (aka 'unsigned char') in initializer list [-Wc++11-narrowing] Log
rlplot 1.5-3QT_Spec.cpp:3299:23: error: non-constant-expression cannot be narrowed from type 'int' to 'unsigned short' in initializer list [-Wc++11-narrowing] Log
sdlbasic 0.0.20070714-6ScintillaGTK.cxx:1356:6: error: non-constant-expression cannot be narrowed from type 'int' to 'guint' (aka 'unsigned int') in initializer list [-Wc++11-narrowing] Log
sdrangelove 0.0.1.20150707-2miniz.cpp:2782:72: error: non-constant-expression cannot be narrowed from type 'char' to 'mz_uint8' (aka 'unsigned char') in initializer list [-Wc++11-narrowing] Log
simutrans 120.2.2-3gui/simwin.cc:503:11: error: case value evaluates to -1, which cannot be narrowed to type 'uint32' (aka 'unsigned int') [-Wc++11-narrowing] Log 750121
sitplus 1.0.3-5.1crvmisc.cpp:63:7: error: case value evaluates to 2147483680, which cannot be narrowed to type 'int' [-Wc++11-narrowing] Log
skstream 0.3.9-3skpoll.cpp:66:33: error: non-constant-expression cannot be narrowed from type 'unsigned long' to '__time_t' (aka 'long') in initializer list [-Wc++11-narrowing] Log
stimfit 0.15.6-1../../src/pystfio/pystfio_wrap.cxx:3636:29: error: non-constant-expression cannot be narrowed from type 'size_t' (aka 'unsigned long') to 'npy_intp' (aka 'long') in initializer list [-Wc++11-narrowing] Log
stormbaancoureur 2.1.6-2./carpettrack.h:18:55: error: non-constant-expression cannot be narrowed from type 'double' to 'float' in initializer list [-Wc++11-narrowing] Log
stressapptest 1.0.6-2worker.cc:2994:14: error: case value evaluates to -5, which cannot be narrowed to type 'unsigned long' [-Wc++11-narrowing] Log
theano 0.9.0+dfsg-2Exception: ("Compilation failed (return status=1): In file included from /<>/theano-0.9.0+dfsg/.pybuild/compiledir_Linux-4.9--amd64-x86_64-with-debian-buster-sid--2.7.15-64/tmpNGVecH/mod.cpp:1:. In file included from /usr/include/python2.7/Python.h:88:. /usr/include/python2.7/unicodeobject.h:534:5: warning: 'register' storage class specifier is deprecated and incompatible with C++17 [-Wdeprecated-register]. register PyObject *obj, /* Object */. ^~~~~~~~~. /usr/include/python2.7/unicodeobject.h:553:5: warning: 'register' storage class specifier is deprecated and incompatible with C++17 [-Wdeprecated-register]. register PyObject *obj /* Object */. ^~~~~~~~~. /usr/include/python2.7/unicodeobject.h:575:5: warning: 'register' storage class specifier is deprecated and incompatible with C++17 [-Wdeprecated-register]. register const wchar_t *w, /* wchar_t buffer */. ^~~~~~~~~. /usr/include/python2.7/unicodeobject.h:593:5: warning: 'register' storage class specifier is deprecated and incompatible with C++17 [-Wdeprecated-register]. register wchar_t *w, /* wchar_t buffer */. ^~~~~~~~~. In file included from /<>/theano-0.9.0+dfsg/.pybuild/compiledir_Linux-4.9--amd64-x86_64-with-debian-buster-sid--2.7.15-64/tmpNGVecH/mod.cpp:1:. In file included from /usr/include/python2.7/Python.h:97:. /usr/include/python2.7/stringobject.h:173:5: warning: 'register' storage class specifier is deprecated and incompatible with C++17 [-Wdeprecated-register]. register PyObject *obj, /* string or Unicode object */. ^~~~~~~~~. /usr/include/python2.7/stringobject.h:174:5: warning: 'register' storage class specifier is deprecated and incompatible with C++17 [-Wdeprecated-register]. register char **s, /* pointer to buffer variable */. ^~~~~~~~~. /usr/include/python2.7/stringobject.h:175:5: warning: 'register' storage class specifier is deprecated and incompatible with C++17 [-Wdeprecated-register]. register Py_ssize_t *len /* pointer to length variable or NULL. ^~~~~~~~~. /<>/theano-0.9.0+dfsg/.pybuild/compiledir_Linux-4.9--amd64-x86_64-with-debian-buster-sid--2.7.15-64/tmpNGVecH/mod.cpp:408:27: error: non-constant-expression cannot be narrowed from type 'npy_intp' (aka 'long') to 'int' in initializer list [-Wc++11-narrowing]. int init_totals[4] = {V1_n0, V1_n1, V1_n2, V1_n3};. ^~~~~. /<>/theano-0.9.0+dfsg/.pybuild/compiledir_Linux-4.9--amd64-x86_64-with-debian-buster-sid--2.7.15-64/tmpNGVecH/mod.cpp:408:27: note: insert an explicit cast to silence this issue. int init_totals[4] = {V1_n0, V1_n1, V1_n2, V1_n3};. ^~~~~. static_cast( ). /<>/theano-0.9.0+dfsg/.pybuild/compiledir_Linux-4.9--amd64-x86_64-with-debian-buster-sid--2.7.15-64/tmpNGVecH/mod.cpp:408:34: error: non-constant-expression cannot be narrowed from type 'npy_intp' (aka 'long') to 'int' in initializer list [-Wc++11-narrowing]. int init_totals[4] = {V1_n0, V1_n1, V1_n2, V1_n3};. ^~~~~. /<>/theano-0.9.0+dfsg/.pybuild/compiledir_Linux-4.9--amd64-x86_64-with-debian-buster-sid--2.7.15-64/tmpNGVecH/mod.cpp:408:34: note: insert an explicit cast to silence this issue. int init_totals[4] = {V1_n0, V1_n1, V1_n2, V1_n3};. ^~~~~. static_cast( ). /<>/theano-0.9.0+dfsg/.pybuild/compiledir_Linux-4.9--amd64-x86_64-with-debian-buster-sid--2.7.15-64/tmpNGVecH/mod.cpp:408:41: error: non-constant-expression cannot be narrowed from type 'npy_intp' (aka 'long') to 'int' in initializer list [-Wc++11-narrowing]. int init_totals[4] = {V1_n0, V1_n1, V1_n2, V1_n3};. ^~~~~. /<>/theano-0.9.0+dfsg/.pybuild/compiledir_Linux-4.9--amd64-x86_64-with-debian-buster-sid--2.7.15-64/tmpNGVecH/mod.cpp:408:41: note: insert an explicit cast to silence this issue. int init_totals[4] = {V1_n0, V1_n1, V1_n2, V1_n3};. ^~~~~. static_cast( ). /<>/theano-0.9.0+dfsg/.pybuild/compiledir_Linux-4.9--amd64-x86_64-with-debian-buster-sid--2.7.15-64/tmpNGVecH/mod.cpp:408:48: error: non-constant-expression cannot be narrowed from type 'npy_intp' (aka 'long') to 'int' in initializer list [-Wc++11-narrowing]. int init_totals[4] = {V1_n0, V1_n1, V1_n2, V1_n3};. ^~~~~. /<>/theano-0.9.0+dfsg/.pybuild/compiledir_Linux-4.9--amd64-x86_64-with-debian-buster-sid--2.7.15-64/tmpNGVecH/mod.cpp:408:48: note: insert an explicit cast to silence this issue. int init_totals[4] = {V1_n0, V1_n1, V1_n2, V1_n3};. ^~~~~. static_cast( ). /<>/theano-0.9.0+dfsg/.pybuild/compiledir_Linux-4.9--amd64-x86_64-with-debian-buster-sid--2.7.15-64/tmpNGVecH/mod.cpp:427:1: error: non-constant-expression cannot be narrowed from type 'ssize_t' (aka 'long') to 'int' in initializer list [-Wc++11-narrowing]. V1_stride0, V1_stride1, V1_stride2, V1_stride3. ^~~~~~~~~~. /<>/theano-0.9.0+dfsg/.pybuild/compiledir_Linux-4.9--amd64-x86_64-with-debian-buster-sid--2.7.15-64/tmpNGVecH/mod.cpp:427:1: note: insert an explicit cast to silence this issue. V1_stride0, V1_stride1, V1_stride2, V1_stride3. ^~~~~~~~~~. static_cast( ). /<>/theano-0.9.0+dfsg/.pybuild/compiledir_Linux-4.9--amd64-x86_64-with-debian-buster-sid--2.7.15-64/tmpNGVecH/mod.cpp:427:13: error: non-constant-expression cannot be narrowed from type 'ssize_t' (aka 'long') to 'int' in initializer list [-Wc++11-narrowing]. V1_stride0, V1_stride1, V1_stride2, V1_stride3. ^~~~~~~~~~. /<>/theano-0.9.0+dfsg/.pybuild/compiledir_Linux-4.9--amd64-x86_64-with-debian-buster-sid--2.7.15-64/tmpNGVecH/mod.cpp:427:13: note: insert an explicit cast to silence this issue. V1_stride0, V1_stride1, V1_stride2, V1_stride3. ^~~~~~~~~~. static_cast( ). /<>/theano-0.9.0+dfsg/.pybuild/compiledir_Linux-4.9--amd64-x86_64-with-debian-buster-sid--2.7.15-64/tmpNGVecH/mod.cpp:427:25: error: non-constant-expression cannot be narrowed from type 'ssize_t' (aka 'long') to 'int' in initializer list [-Wc++11-narrowing]. V1_stride0, V1_stride1, V1_stride2, V1_stride3. ^~~~~~~~~~. /<>/theano-0.9.0+dfsg/.pybuild/compiledir_Linux-4.9--amd64-x86_64-with-debian-buster-sid--2.7.15-64/tmpNGVecH/mod.cpp:427:25: note: insert an explicit cast to silence this issue. V1_stride0, V1_stride1, V1_stride2, V1_stride3. ^~~~~~~~~~. static_cast( ). /<>/theano-0.9.0+dfsg/.pybuild/compiledir_Linux-4.9--amd64-x86_64-with-debian-buster-sid--2.7.15-64/tmpNGVecH/mod.cpp:427:37: error: non-constant-expression cannot be narrowed from type 'ssize_t' (aka 'long') to 'int' in initializer list [-Wc++11-narrowing]. V1_stride0, V1_stride1, V1_stride2, V1_stride3. ^~~~~~~~~~. /<>/theano-0.9.0+dfsg/.pybuild/compiledir_Linux-4.9--amd64-x86_64-with-debian-buster-sid--2.7.15-64/tmpNGVecH/mod.cpp:427:37: note: insert an explicit cast to silence this issue. V1_stride0, V1_stride1, V1_stride2, V1_stride3. ^~~~~~~~~~. static_cast( ). 7 warnings and 8 errors generated.. ", '[Elemwise{Cast{float32}}(TensorConstant{(1, 1, 1, 1) of 0})]') Log
tinyos-tools 1.4.2-3AvrAtmel.C:190:30: error: non-constant-expression cannot be narrowed from type 'unsigned int' to 'TByte' (aka 'unsigned char') in initializer list [-Wc++11-narrowing] Log
torcs 1.3.7+dfsg-4driver.cpp:805:13: error: non-constant-expression cannot be narrowed from type 'double' to 'float' in initializer list [-Wc++11-narrowing] Log
vdr-plugin-dvd 0.3.6~b03+cvs20090426.0013-25player-dvd.c:3083:33: error: non-constant-expression cannot be narrowed from type 'uint16_t' (aka 'unsigned short') to 'char' in initializer list [-Wc++11-narrowing] Log
vdr-plugin-fritzbox 1.5.3-7notifyosd.cpp:131:23: error: non-constant-expression cannot be narrowed from type 'unsigned int' to 'int' in initializer list [-Wc++11-narrowing] Log
vdr-plugin-xine 0.9.4-15xineDevice.c:1401:19: error: non-constant-expression cannot be narrowed from type 'int' to 'uchar' (aka 'unsigned char') in initializer list [-Wc++11-narrowing] Log
warmux 1:11.04.1+repack2-3map/tile.cpp:676:30: error: non-constant-expression cannot be narrowed from type 'uint' (aka 'unsigned int') to 'uint16_t' (aka 'unsigned short') in initializer list [-Wc++11-narrowing] Log
wxastrocapture 1.8.1+git20140821+dfsg-2wxWebcam/Atik16Cmd.cpp:282:34: error: non-constant-expression cannot be narrowed from type 'int' to '_byte' (aka 'unsigned char') in initializer list [-Wc++11-narrowing] Log
xplc 0.3.13-7xplc/moduleloader.cpp:65:8: error: case value evaluates to -1, which cannot be narrowed to type 'unsigned int' [-Wc++11-narrowing] Log
yagf 0.9.3.2-1qipblackandwhiteimage.cpp:150:22: error: non-constant-expression cannot be narrowed from type 'int' to 'quint32' (aka 'unsigned int') in initializer list [-Wc++11-narrowing] Log
zvbi 0.2.35-13test-hamm.cc:120:22: error: non-constant-expression cannot be narrowed from type 'unsigned int' to 'uint8_t' (aka 'unsigned char') in initializer list [-Wc++11-narrowing] Log
104 errors
Return to the list