Debian Package rebuild

Rebuild of the Debian archive with clang

"Cannot be narrowed" build failure(s)
clang 9.0.1
Return to the list

Versions: 2.9 - 3.0 - 3.1 - 3.2 - 3.3 - 3.4 - 3.4.2 - 3.5.0 - 3.6.0 - 3.8.1 - 3.9.1 - 4.0.1 - 5.0 - 6.0 - 8.0.1 - 9.0.1 - 10
PackageVersionSupposed error messageFull log Bug report
achilles 2-9opengl.cc:103:28: error: non-constant-expression cannot be narrowed from type 'double' to 'GLfloat' (aka 'float') in initializer list [-Wc++11-narrowing] Log
aewm++-goodies 1.0-10appbar.cc:1142:21: error: non-constant-expression cannot be narrowed from type 'int' to 'CARD32' (aka 'unsigned int') in initializer list [-Wc++11-narrowing] Log
ale 0.9.0.3-4./d3/focus.h:78:15: error: non-constant-expression cannot be narrowed from type 'unsigned int' to 'int' in initializer list [-Wc++11-narrowing] Log
amoebax 0.2.1+dfsg-4NewHighScoreState.cxx:399:30: error: non-constant-expression cannot be narrowed from type 'int' to 'char' in initializer list [-Wc++11-narrowing] Log
amphetamine 0.8.10-21src/Element.cpp:282:25: error: type 'double' cannot be narrowed to 'short' in initializer list [-Wc++11-narrowing] Log
antigrav 0.0.3-9terrain.cpp:490:51: error: non-constant-expression cannot be narrowed from type 'double' to 'float' in initializer list [-Wc++11-narrowing] Log
asc 2.6.1.0-6pgbutton.cpp:105:8: error: case value evaluates to 2147483649, which cannot be narrowed to type 'int' [-Wc++11-narrowing] Log
audiofile 0.3.6-5Sign.cpp:160:39: error: non-constant-expression cannot be narrowed from type 'int32_t' (aka 'int') to 'uint32_t' (aka 'unsigned int') in initializer list [-Wc++11-narrowing] Log
bastet 0.43-5Ui.cpp:174:18: error: non-constant-expression cannot be narrowed from type 'unsigned long' to 'int' in initializer list [-Wc++11-narrowing] Log
bist 0.5.2-1.1gruppo.cpp:1407:35: error: non-constant-expression cannot be narrowed from type 'int' to 'double' in initializer list [-Wc++11-narrowing] Log
blackbox 0.70.1-37EWMH.cc:250:7: error: non-constant-expression cannot be narrowed from type 'long' to 'unsigned long' in initializer list [-Wc++11-narrowing] Log
blobandconquer 1.11-dfsg+20-1.1src/hud/dialogs.cpp:124:27: error: non-constant-expression cannot be narrowed from type 'int' to 'Uint16' (aka 'unsigned short') in initializer list [-Wc++11-narrowing] Log
blocks-of-the-undead 1.0-7CSurface.cpp:468:55: error: non-constant-expression cannot be narrowed from type 'Sint16' (aka 'short') to 'Uint16' (aka 'unsigned short') in initializer list [-Wc++11-narrowing] Log
brainparty 0.61+dfsg-5BPGame.cpp:1506:25: error: non-constant-expression cannot be narrowed from type 'int' to 'GLfloat' (aka 'float') in initializer list [-Wc++11-narrowing] Log
briquolo 0.5.7-8MOGL_PoliceTTF.cpp:346:23: error: non-constant-expression cannot be narrowed from type 'unsigned int' to 'Sint16' (aka 'short') in initializer list [-Wc++11-narrowing] Log
ceferino 0.97.8+svn37-2juego.cc:119:24: error: non-constant-expression cannot be narrowed from type 'int' to 'Uint16' (aka 'unsigned short') in initializer list [-Wc++11-narrowing] Log
clucene-core 2.3.3.4+dfsg-1QueryParser.cpp:82:176: error: constant expression evaluates to 2147483648 which cannot be narrowed to type 'int32_t' (aka 'int') [-Wc++11-narrowing] Log
cmtk 3.3.1p1+dfsg-2vtkxform.cxx:190:24: error: non-constant-expression cannot be narrowed from type 'double' to 'float' in initializer list [-Wc++11-narrowing] Log
concavity 0.1+dfsg.1-4R2Grid.C:2325:37: error: non-constant-expression cannot be narrowed from type 'int' to 'unsigned int' in initializer list [-Wc++11-narrowing] Log
connectome-workbench 1.4.2-1AlgorithmCiftiCorrelationGradient.cxx:789:28: error: non-constant-expression cannot be narrowed from type 'int64_t' (aka 'long') to 'int' in initializer list [-Wc++11-narrowing] Log
critterding 1.0-beta12.1-1.3BulletSoftBody/btSoftBodyHelpers.cpp:288:23: error: non-constant-expression cannot be narrowed from type 'unsigned int' to 'int' in initializer list [-Wc++11-narrowing] Log
desmume 0.9.11-3gfx3d.cpp:1218:3: error: non-constant-expression cannot be narrowed from type 'int' to 'u8' (aka 'unsigned char') in initializer list [-Wc++11-narrowing] Log
dnprogs 2.65connection.cc:932:23: error: non-constant-expression cannot be narrowed from type 'int' to 'char' in initializer list [-Wc++11-narrowing] Log
einstein 2.0.dfsg.2-10screen.cpp:119:32: error: non-constant-expression cannot be narrowed from type 'int' to 'Uint16' (aka 'unsigned short') in initializer list [-Wc++11-narrowing] Log
entropybroker 2.9-3main.cpp:196:24: error: non-constant-expression cannot be narrowed from type 'int' to 'rlim_t' (aka 'unsigned long') in initializer list [-Wc++11-narrowing] Log
eris 1.3.23-7PollDefault.cpp:80:28: error: non-constant-expression cannot be narrowed from type 'unsigned long' to '__time_t' (aka 'long') in initializer list [-Wc++11-narrowing] Log
extundelete 0.2.4-2extundelete.cc:1271:28: error: non-constant-expression cannot be narrowed from type 'int' to 'ext2_ino_t' (aka 'unsigned int') in initializer list [-Wc++11-narrowing] Log
fastml 3.11-2computeCorrelations.cpp:1347:36: error: non-constant-expression cannot be narrowed from type 'double' to 'float' in initializer list [-Wc++11-narrowing] Log
fig2sxd 0.20-1zipwrite.cpp:91:32: error: non-constant-expression cannot be narrowed from type 'int' to 'unsigned char' in initializer list [-Wc++11-narrowing] Log
fltk1.1 1.1.10-26menubar.cxx:139:28: error: non-constant-expression cannot be narrowed from type 'Fl_Labeltype' to 'uchar' (aka 'unsigned char') in initializer list [-Wc++11-narrowing] Log 755228
fs-uae 3.0.2+dfsg-2src/blkdev.cpp:758:40: error: non-constant-expression cannot be narrowed from type 'int' to 'uae_u8' (aka 'unsigned char') in initializer list [-Wc++11-narrowing] Log
geoip 1.6.12-6debian/src/geoip-csv-to-dat.cpp:658:4: error: non-constant-expression cannot be narrowed from type 'unsigned long' to 'uint8_t' (aka 'unsigned char') in initializer list [-Wc++11-narrowing] Log
ghemical 3.0.0-5filetrans.cpp:357:5: error: non-constant-expression cannot be narrowed from type 'double' to 'fGL' (aka 'float') in initializer list [-Wc++11-narrowing] Log 756440
giac 1.5.0.85+dfsg1-3Graph.cc:550:24: error: non-constant-expression cannot be narrowed from type 'double' to 'GLfloat' (aka 'float') in initializer list [-Wc++11-narrowing] Log
gmetadom 0.2.6-7./../include/GdomeSmartDOMTraits.hh:102:25: error: non-constant-expression cannot be narrowed from type 'std::char_traits::int_type' (aka 'unsigned long') to 'std::char_traits::char_type' (aka 'unsigned short') in initializer list [-Wc++11-narrowing] Log
grfcodec 6.0.6-4src/command.cpp:306:8: error: case value evaluates to -1, which cannot be narrowed to type 'uint' (aka 'unsigned int') [-Wc++11-narrowing] Log
gsmlib 1.10+20120414.gita5e5ae9a-0.3gsm_me_ta.cc:994:45: error: non-constant-expression cannot be narrowed from type 'int' to 'unsigned char' in initializer list [-Wc++11-narrowing] Log
hex-a-hop 1.1.0+git20140926-1hex_puzzzle.cpp:351:17: error: non-constant-expression cannot be narrowed from type 'int' to 'Sint16' (aka 'short') in initializer list [-Wc++11-narrowing] Log
itksnap 3.6.0-5SliceWindowInteractionDelegateWidget.cxx:126:30: error: non-constant-expression cannot be narrowed from type 'unsigned int' to 'GLint' (aka 'int') in initializer list [-Wc++11-narrowing] Log
kcm-fcitx 0.5.5-2skinpage.cpp:134:10: error: case value evaluates to 2401319027, which cannot be narrowed to type 'int' [-Wc++11-narrowing] Log
kino 1.3.4+dfsg0-1page_capture.cc:1649:12: error: non-constant-expression cannot be narrowed from type 'unsigned long' to '__syscall_slong_t' (aka 'long') in initializer list [-Wc++11-narrowing] Log
kmplayer 1:0.12.0b-3viewarea.cpp:2538:57: error: non-constant-expression cannot be narrowed from type 'long' to 'uint32_t' (aka 'unsigned int') in initializer list [-Wc++11-narrowing] Log
latd 1.35llogin.cc:231:25: error: non-constant-expression cannot be narrowed from type 'int' to 'char' in initializer list [-Wc++11-narrowing] Log
libghemical 3.0.0-4.2model.cpp:2566:20: error: non-constant-expression cannot be narrowed from type 'double' to 'fGL' (aka 'float') in initializer list [-Wc++11-narrowing] Log
libgltf 0.1.0-3Shaders.cpp:131:13: error: non-constant-expression cannot be narrowed from type 'size_t' (aka 'unsigned long') to 'GLint' (aka 'int') in initializer list [-Wc++11-narrowing] Log
libretro-gambatte 0.5.0+git20160522+dfsg1-2src/statesaver.cpp:277:43: error: non-constant-expression cannot be narrowed from type 'unsigned int' to 'unsigned char' in initializer list [-Wc++11-narrowing] Log
milkytracker 1.02.00+dfsg-2EQConstants.cpp:30:2: error: non-constant-expression cannot be narrowed from type 'typename __gnu_cxx::__enable_if<__is_integer::__value, double>::__type' (aka 'double') to 'float' in initializer list [-Wc++11-narrowing] Log
molds 0.3.1-1base/../mpi/MpiProcess.h:177:41: error: non-constant-expression cannot be narrowed from type 'MolDS_mpi::molds_mpi_int' (aka 'long') to 'int' in initializer list [-Wc++11-narrowing] Log
nullmailer 1:2.2-3inject.cc:211:3: error: non-constant-expression cannot be narrowed from type 'size_t' (aka 'unsigned long') to 'unsigned int' in initializer list [-Wc++11-narrowing] Log
numptyphysics 0.2+svn157-0.4Canvas.cpp:457:26: error: non-constant-expression cannot be narrowed from type 'int' to 'Sint16' (aka 'short') in initializer list [-Wc++11-narrowing] Log
ode 2:0.16-3demo_cylvssphere.cpp:154:20: error: non-constant-expression cannot be narrowed from type 'dReal' (aka 'double') to 'float' in initializer list [-Wc++11-narrowing] Log
ogre-1.9 1.9.0+dfsg1-12OgreX11EGLWindow.cpp:558:30: error: non-constant-expression cannot be narrowed from type 'Ogre::uint' (aka 'unsigned int') to 'int' in initializer list [-Wc++11-narrowing] Log
openni 1.5.4.0+dfsg-4../../../../../Wrappers/OpenNI.jni/org_OpenNI_NativeMethods.cpp:971:24: error: non-constant-expression cannot be narrowed from type 'jbyte' (aka 'signed char') to 'XnUInt8' (aka 'unsigned char') in initializer list [-Wc++11-narrowing] Log
p7zip 16.02+dfsg-7../../../../CPP/Windows/ErrorMsg.cpp:18:10: error: case value evaluates to -2147467263, which cannot be narrowed to type 'DWORD' (aka 'unsigned int') [-Wc++11-narrowing] Log
pcsc-cyberjack 3.99.5final.sp13+dfsg-2ifd.cpp:967:8: error: case value evaluates to 3221225848, which cannot be narrowed to type 'CJ_RESULT' (aka 'int') [-Wc++11-narrowing] Log
pekwm 0.1.17-3ActionHandler.cc:586:10: error: case value evaluates to 4294967286, which cannot be narrowed to type 'int' [-Wc++11-narrowing] Log
pkcs11-dump 0.3.4-1.1pkcs11-dump.cpp:1139:6: error: non-constant-expression cannot be narrowed from type 'int' to 'CK_ATTRIBUTE_TYPE' (aka 'unsigned long') in initializer list [-Wc++11-narrowing] Log
pong2 0.1.3-2Framework.cpp:270:23: error: non-constant-expression cannot be narrowed from type 'double' to 'GLfloat' (aka 'float') in initializer list [-Wc++11-narrowing] Log
primrose 6+dfsg1-4Panel.cpp:211:13: error: non-constant-expression cannot be narrowed from type 'int' to 'GLfloat' (aka 'float') in initializer list [-Wc++11-narrowing] Log
procinfo 1:2.0.304-3./lib/timeRoutines.cpp:134:38: error: non-constant-expression cannot be narrowed from type 'uint32_t' (aka 'unsigned int') to 'int' in initializer list [-Wc++11-narrowing] Log
raidutils 0.0.6-22command.cpp:1670:7: error: non-constant-expression cannot be narrowed from type 'int' to 'uCHAR' (aka 'unsigned char') in initializer list [-Wc++11-narrowing] Log
scim 1.4.18-2.2scim_panel_gtk.cpp:2563:34: error: type 'double' cannot be narrowed to 'guint16' (aka 'unsigned short') in initializer list [-Wc++11-narrowing] Log 750115
scram 0.16.2-1preprocessor.h:51:17: error: constexpr if condition evaluates to 2, which cannot be narrowed to type 'bool' [-Wc++11-narrowing] Log
sdrangelove 0.0.1.20150707-3miniz.cpp:2782:72: error: non-constant-expression cannot be narrowed from type 'char' to 'mz_uint8' (aka 'unsigned char') in initializer list [-Wc++11-narrowing] Log
silverjuke 18.2.1-2src/prjm/src/Renderer/SOIL/stb_image_aug.c:3386:33: error: non-constant-expression cannot be narrowed from type 'int' to 'stbi_uc' (aka 'unsigned char') in initializer list [-Wc++11-narrowing] Log
skstream 0.3.9-4skpoll.cpp:66:33: error: non-constant-expression cannot be narrowed from type 'unsigned long' to '__time_t' (aka 'long') in initializer list [-Wc++11-narrowing] Log
stormbaancoureur 2.1.6-2./carpettrack.h:18:55: error: non-constant-expression cannot be narrowed from type 'double' to 'float' in initializer list [-Wc++11-narrowing] Log
stressapptest 1.0.6-2worker.cc:2994:14: error: case value evaluates to -5, which cannot be narrowed to type 'unsigned long' [-Wc++11-narrowing] Log
theano 1.0.4+dfsg-1Exception: ('The following error happened while compiling the node', Elemwise{Composite{scalar_sigmoid((i0 + i1))}}[(0, 0)](Dot22.0, InplaceDimShuffle{x,0}.0), '\n', "Compilation failed (return status=1): /<>/jupyter_tmp/.pybuild/compiledir_Linux-4.19--cloud-amd64-x86_64-with-debian-bullseye-sid--3.7.6-64/tmp_ydmrh4n/mod.cpp:463:27: error: non-constant-expression cannot be narrowed from type 'npy_intp' (aka 'long') to 'int' in initializer list [-Wc++11-narrowing]. int init_totals[2] = {V3_n0, V3_n1};. ^~~~~. /<>/jupyter_tmp/.pybuild/compiledir_Linux-4.19--cloud-amd64-x86_64-with-debian-bullseye-sid--3.7.6-64/tmp_ydmrh4n/mod.cpp:463:27: note: insert an explicit cast to silence this issue. int init_totals[2] = {V3_n0, V3_n1};. ^~~~~. static_cast( ). /<>/jupyter_tmp/.pybuild/compiledir_Linux-4.19--cloud-amd64-x86_64-with-debian-bullseye-sid--3.7.6-64/tmp_ydmrh4n/mod.cpp:463:34: error: non-constant-expression cannot be narrowed from type 'npy_intp' (aka 'long') to 'int' in initializer list [-Wc++11-narrowing]. int init_totals[2] = {V3_n0, V3_n1};. ^~~~~. /<>/jupyter_tmp/.pybuild/compiledir_Linux-4.19--cloud-amd64-x86_64-with-debian-bullseye-sid--3.7.6-64/tmp_ydmrh4n/mod.cpp:463:34: note: insert an explicit cast to silence this issue. int init_totals[2] = {V3_n0, V3_n1};. ^~~~~. static_cast( ). /<>/jupyter_tmp/.pybuild/compiledir_Linux-4.19--cloud-amd64-x86_64-with-debian-bullseye-sid--3.7.6-64/tmp_ydmrh4n/mod.cpp:475:9: error: non-constant-expression cannot be narrowed from type 'ssize_t' (aka 'long') to 'int' in initializer list [-Wc++11-narrowing]. V3_stride0, V3_stride1, . ^~~~~~~~~~. /<>/jupyter_tmp/.pybuild/compiledir_Linux-4.19--cloud-amd64-x86_64-with-debian-bullseye-sid--3.7.6-64/tmp_ydmrh4n/mod.cpp:475:9: note: insert an explicit cast to silence this issue. V3_stride0, V3_stride1, . ^~~~~~~~~~. static_cast( ). /<>/jupyter_tmp/.pybuild/compiledir_Linux-4.19--cloud-amd64-x86_64-with-debian-bullseye-sid--3.7.6-64/tmp_ydmrh4n/mod.cpp:475:21: error: non-constant-expression cannot be narrowed from type 'ssize_t' (aka 'long') to 'int' in initializer list [-Wc++11-narrowing]. V3_stride0, V3_stride1, . ^~~~~~~~~~. /<>/jupyter_tmp/.pybuild/compiledir_Linux-4.19--cloud-amd64-x86_64-with-debian-bullseye-sid--3.7.6-64/tmp_ydmrh4n/mod.cpp:475:21: note: insert an explicit cast to silence this issue. V3_stride0, V3_stride1, . ^~~~~~~~~~. static_cast( ). /<>/jupyter_tmp/.pybuild/compiledir_Linux-4.19--cloud-amd64-x86_64-with-debian-bullseye-sid--3.7.6-64/tmp_ydmrh4n/mod.cpp:476:4: error: non-constant-expression cannot be narrowed from type 'ssize_t' (aka 'long') to 'int' in initializer list [-Wc++11-narrowing]. 0, V5_stride1. ^~~~~~~~~~. /<>/jupyter_tmp/.pybuild/compiledir_Linux-4.19--cloud-amd64-x86_64-with-debian-bullseye-sid--3.7.6-64/tmp_ydmrh4n/mod.cpp:476:4: note: insert an explicit cast to silence this issue. 0, V5_stride1. ^~~~~~~~~~. static_cast( ). 5 errors generated.. ", '[Elemwise{Composite{scalar_sigmoid((i0 + i1))}}[(0, 0)](, )]') Log
torcs 1.3.7+dfsg-4driver.cpp:805:13: error: non-constant-expression cannot be narrowed from type 'double' to 'float' in initializer list [-Wc++11-narrowing] Log
vdr-plugin-dvd 0.3.6~b03+cvs20090426.0013-28player-dvd.c:3083:33: error: non-constant-expression cannot be narrowed from type 'uint16_t' (aka 'unsigned short') to 'char' in initializer list [-Wc++11-narrowing] Log
vdr-plugin-xine 0.9.4-17xineDevice.c:1401:19: error: non-constant-expression cannot be narrowed from type 'int' to 'uchar' (aka 'unsigned char') in initializer list [-Wc++11-narrowing] Log
visualboyadvance 1.8.0.dfsg-5../Cheats.cpp:2498:5: error: non-constant-expression cannot be narrowed from type 'unsigned int' to 'u8' (aka 'unsigned char') in initializer list [-Wc++11-narrowing] Log
warmux 1:11.04.1+repack2-4map/tile.cpp:676:30: error: non-constant-expression cannot be narrowed from type 'uint' (aka 'unsigned int') to 'uint16_t' (aka 'unsigned short') in initializer list [-Wc++11-narrowing] Log
wxastrocapture 1.8.1+git20140821.796e1a1+dfsg-1wxWebcam/Atik16Cmd.cpp:282:34: error: non-constant-expression cannot be narrowed from type 'int' to '_byte' (aka 'unsigned char') in initializer list [-Wc++11-narrowing] Log
xplc 0.3.13-7xplc/moduleloader.cpp:65:8: error: case value evaluates to -1, which cannot be narrowed to type 'unsigned int' [-Wc++11-narrowing] Log
zvbi 0.2.35-17test-hamm.cc:120:22: error: non-constant-expression cannot be narrowed from type 'unsigned int' to 'uint8_t' (aka 'unsigned char') in initializer list [-Wc++11-narrowing] Log
zytrax 0+git20190810-2gui/pattern_editor.cpp:3012:21: error: non-constant-expression cannot be narrowed from type 'int' to 'char' in initializer list [-Wc++11-narrowing] Log
78 errors
Return to the list