Debian Package rebuild

Rebuild of the Debian archive with clang

"Expected declaration (#define missing?)" build failure(s)
clang 6.0
Return to the list

Versions: 2.9 - 3.0 - 3.1 - 3.2 - 3.3 - 3.4 - 3.4.2 - 3.5.0 - 3.6.0 - 3.8.1 - 3.9.1 - 4.0.1 - 5.0 - 6.0
PackageVersionSupposed error messageFull log Bug report
acm 5.0-29.2xdr_var_array.c:83:12: error: expected parameter declarator Log 740019
ats-lang-anairiats 0.2.11-1bool.cats:42:5: error: expected parameter declarator Log
ats2-lang 0.2.9-1./prelude/CATS/integer.cats:42:5: error: expected parameter declarator Log
chasen 2.4.5-40print.c:186:16: error: expected parameter declarator Log
crash 7.2.1-1./../include/libiberty.h:616:12: error: expected parameter declarator Log
dcap 2.47.12-2./util.h:14:12: error: expected parameter declarator Log 755964
distcc 3.1-6.3src/snprintf.h:30:5: error: expected parameter declarator Log
fribidi 0.19.7-2fribidi-char-sets-cap-rtl.c:109:6: error: expected expression Log
gr-iqbal 0.37.2-11cxvec.h:45:15: error: expected ';' at end of declaration list Log
gtg-trace 0.2-2+dfsg-3C/paje_GTGBasic1_c.c:14:12: error: expected parameter declarator Log
icinga 1.14.2+ds-2./../include/snprintf.h:29:5: error: expected parameter declarator Log
julia 0.4.7-7init.c:608:12: error: expected parameter declarator Log
libesmtp 1.0.6-4.3./missing.h:48:5: error: expected parameter declarator Log
libqb 1.0.3-1_syslog_override.c:45:6: error: expected parameter declarator Log
mawk 1.3.3-17print.c:85:11: error: expected parameter declarator Log
mtools 4.0.18-2mainloop.c:89:15: error: expected ')' Log
node-postgres 0.13.3-1../src/binding.cc:36:27: error: expected class name Log
nvptx-tools 0.20180301-1./../include/libiberty.h:627:12: error: expected parameter declarator Log
pchar 1.5-4./pc.h:28:15: error: expected identifier Log
sdpa 7.3.11+dfsg-1mexFprintf.c:32:5: error: expected parameter declarator Log
snap-aligner 1.0~beta.18+dfsg-2SNAPLib/AlignerContext.cpp:341:34: error: expected ')' Log
socket-wrapper 1.1.9+ds-1socket_wrapper.c:590:3: error: expected expression Log
urjtag 0.10+r2007-1.2../../include/libiberty.h:589:12: error: expected parameter declarator Log
util-vserver 0.30.216-pre3120-1.4fs.h:366:22: error: expected ';' after top level declarator Log
visualboyadvance 1.8.0.dfsg-5debugger.cpp:1725:36: error: expected ')' Log
xevil 2.02r2-10stl_algobase.h:195:9: error: expected unqualified-id Log 742968
26 errors
Return to the list