Debian Package rebuild

Rebuild of the Debian archive with clang

"Expected declaration (#define missing?)" build failure(s)
clang 9.0.1
Return to the list

Versions: 2.9 - 3.0 - 3.1 - 3.2 - 3.3 - 3.4 - 3.4.2 - 3.5.0 - 3.6.0 - 3.8.1 - 3.9.1 - 4.0.1 - 5.0 - 6.0 - 8.0.1 - 9.0.1 - 10rc2
PackageVersionSupposed error messageFull log Bug report
ats-lang-anairiats 0.2.11-1bool.cats:42:5: error: expected parameter declarator Log
ccextractor 0.87+ds1-1../src/lib_ccx/utility.h:41:5: error: expected parameter declarator Log
chasen 2.4.5-44print.c:186:16: error: expected parameter declarator Log
cyrus-sasl2 2.1.27+dfsg-2../../sample/common.c:130:5: error: expected parameter declarator Log 739561
dcap 2.47.12-2./util.h:14:12: error: expected parameter declarator Log 755964
gr-iqbal 0.38-4cxvec.h:45:15: error: expected ';' at end of declaration list Log
gtg-trace 0.2-2+dfsg-6C/paje_GTGBasic1_c.c:14:12: error: expected parameter declarator Log
libesmtp 1.0.6-4.3./missing.h:48:5: error: expected parameter declarator Log
libfiu 1.00-6modules/posix.custom.c:445:42: error: expected parameter declarator Log
libqb 1.0.5-1_syslog_override.c:48:1: error: expected ')' Log
nvptx-tools 0.20180301-1./../include/libiberty.h:627:12: error: expected parameter declarator Log
pchar 1.5-4./pc.h:28:15: error: expected identifier Log
pgtop 3.7.0-18-gbbf1f12-3./c.h:761:1: error: expected parameter declarator Log
snap-aligner 1.0~beta.18+dfsg-3SNAPLib/AlignerContext.cpp:341:34: error: expected ')' Log
urjtag 0.10+r2007-1.2../../include/libiberty.h:589:12: error: expected parameter declarator Log
15 errors
Return to the list