Debian Package rebuild

Rebuild of the Debian archive with clang

"Unused variable" build failure(s)
clang 8svn
Return to the list

Versions: 2.9 - 3.0 - 3.1 - 3.2 - 3.3 - 3.4 - 3.4.2 - 3.5.0 - 3.6.0 - 3.8.1 - 3.9.1 - 4.0.1 - 5.0 - 6.0 - 7.0.1 - 8svn
PackageVersionSupposed error messageFull log Bug report
ola 0.10.7.nojsmin-1plugins/pathport/PathportDevice.cpp:67:46: error: unused variable 'iter' [-Werror,-Wunused-variable] Log
python-escript 5.2-4escriptcore/src/DataVectorOps.h:690:62: error: unused variable 'in20' [-Werror,-Wunused-variable] Log
thrift 0.11.0-4src/thrift/generate/t_py_generator.cc:1603:38: error: unused variable 'a_iter' [-Werror,-Wunused-variable] Log
zeroc-ice 3.7.1-6src/slice2cpp/Gen.cpp:1798:36: error: unused variable 'pi' [-Werror,-Wunused-variable] Log
4 errors
Return to the list