Debian Package rebuild

Rebuild of the Debian archive with clang

"non-void function should return a value" build failure(s)
clang 3.0
Return to the list
With the command
clang -c -Werror plop.c
the code
int myFunction() {
	return;
}
is rejected by clang while accepted with gcc.
Versions: 2.9 - 3.0 - 3.1 - 3.2 - 3.3 - 3.4 - 3.4.2 - 3.5.0 - 3.6.0 - 3.8.1
PackageVersionSupposed error messageFull log Bug report
aalib 1.4p5-39aalinuxkbd.c:203:2: error: non-void function 'rawmode_init' should return a value [-Wreturn-type] Log 739932
ace-of-penguins 1.3-5./make-imglib.c:205:5: error: non-void function 'tokenize' should return a value [-Wreturn-type] Log 741609
ack 1.39-12kanjixcheck.c:215:3: error: non-void function 'CodeCheckAll' should return a value [-Wreturn-type] Log
afpfs-ng 0.8.1-2loop.c:90:14: error: non-void function 'just_end_it_now' should return a value [-Wreturn-type] Log 740023
alliance 5.0-20110203-4elp.c:252:1: error: non-void function 'elpLotrsShrink' should return a value [-Wreturn-type] Log
autolog 0.40-13.1autolog.c:358:2: error: non-void function 'save_users' should return a value [-Wreturn-type] Log 740031
bluemon 1.4-6bluetooth-monitor.c:299:10: error: non-void function 'get_link_qual' should return a value [-Wreturn-type] Log 740036
ctn 3.0.6-13queue.c:256:5: error: non-void function 'queueDisplayImage' should return a value [-Wreturn-type] Log 744085
dvi2dvi 2.0alpha-9.1dviconv.c:119:7: error: non-void function 'dviconv' should return a value [-Wreturn-type] Log 741135
ecl 11.1.1-4unixint.d:261:17: error: non-void function 'lisp_signal_handler' should return a value [-Wreturn-type] Log
fairymax 4.8q-2fairymax.c:476:20: error: non-void function 'LoadGame' should return a value [-Wreturn-type] Log 743008
gbatnav 1.0.4cvs20051004-5play.c:509:3: error: non-void function 'lookup_funcion' should return a value [-Wreturn-type] Log 743696
geki2 2.0.3-8ranking.c:18:5: error: non-void function 'ScoreRanking' should return a value [-Wreturn-type] Log
geki3 1.0.3-7ranking.c:18:5: error: non-void function 'ScoreRanking' should return a value [-Wreturn-type] Log
gpe-timesheet 0.32-2sql.c:531:9: error: non-void function 'find_children_cb' should return a value [-Wreturn-type] Log
gramophone2 0.8.13a-1midifile.c:159:3: error: non-void function 'readheader' should return a value [-Wreturn-type] Log 760662
grcm 0.1.6-1callbacks.c:134:4: error: non-void function 'on_ConnectionsWindow_delete_event' should return a value [-Wreturn-type] Log 760664
gtimer 2.0.0-1custom-list.c:613:3: error: non-void function 'custom_list_append_record' should return a value [-Wreturn-type] Log 743313
hpsockd 0.17v5.c:162:3: error: non-void function 'v5Request' should return a value [-Wreturn-type] Log
ibus-array 0.0.2-6engine.c:363:9: error: non-void function 'ibus_array_engine_update_symbol_lookup_table' should return a value [-Wreturn-type] Log 743130
ipmitool 1.8.11-5ipmi_hpmfwupg.c:1236:9: error: non-void function 'HpmfwupgTargetCheck' should return a value [-Wreturn-type] Log
ircp-tray 0.7.6-1.1sendfile.c:118:3: error: non-void function 'send_session_new' should return a value [-Wreturn-type] Log 743127
jbofihe 0.38-5.1compdfa.c:321:19: error: non-void function 'compress_dfa' should return a value [-Wreturn-type] Log
lcrt 1.1.1-1ssh.c:880:13: error: non-void function 'lcrt_ssh_create' should return a value [-Wreturn-type] Log 742543
lebiniou 3.13-1init_uninit.c:145:7: error: non-void function 'init_device' should return a value [-Wreturn-type] Log
libgraphics-libplot-perl 2.2.2-5Libplot.xs:91:6: error: non-void function 'constant' should return a value [-Wreturn-type] Log
libmail-cclient-perl 1.12-11Cclient.xs:1031:2: error: non-void function 'mm_diskerror' should return a value [-Wreturn-type] Log 742431
libreadline-java 0.8.0.1+dfsg-2org_gnu_readline_Readline.c:657:5: error: non-void function 'java_completer' should return a value [-Wreturn-type] Log 742220
libytnef 1.5-4ytnef.c:568:9: error: non-void function 'TNEFHexBreakdown' should return a value [-Wreturn-type] Log 742146
magic 7.5.214-1EFvisit.c:579:2: error: non-void function 'efVisitSingleResist' should return a value [-Wreturn-type] Log
makejvf 1.1a+0-2write.c:123:4: error: non-void function 'writevf' should return a value [-Wreturn-type] Log
mendexk 2.6e-3fread.c:552:5: error: non-void function 'chkpageattr' should return a value [-Wreturn-type] Log
menu-cache 0.3.2-2.1menu-cache.c:229:9: error: non-void function 'read_item' should return a value [-Wreturn-type] Log
midgard2-core 10.05.5.1-1src/midgard_core_query.c:2482:3: error: non-void function 'midgard_core_query_get_objects' should return a value [-Wreturn-type] Log
moria 5.6-2signals.c:139:7: error: non-void function 'signal_handler' should return a value [-Wreturn-type] Log
mtink 1.0.16-3mainSrc/rdRes.c:605:19: error: non-void function 'searchCmp' should return a value [-Wreturn-type] Log 742063
mtpfs 1.0-1mtpfs.c:569:5: error: non-void function 'mtpfs_release' should return a value [-Wreturn-type] Log
nagios3 3.2.3-3checks.c:624:4: error: non-void function 'run_async_service_check' should return a value [-Wreturn-type] Log
ng 1.5~beta1-3tty.c:284:3: error: non-void function 'ttinsl' should return a value [-Wreturn-type] Log 760672
obconf 2.0.3+git20110808-1src/main.c:216:9: error: non-void function 'main' should return a value [-Wreturn-type] Log
orville-write 2.55-2.3wrt_hist.c:92:3: error: non-void function 'put_hist' should return a value [-Wreturn-type] Log 760674
pam-fprint 20080330+git-5pam_fprint.c:44:3: error: non-void function 'send_info_msg' should return a value [-Wreturn-type] Log
php-suhosin 0.9.32.1-1execute.c:1090:3: error: non-void function 'ih_function_exists' should return a value [-Wreturn-type] Log
pmacct 0.12.1-1ll.c:117:5: error: non-void function 'mpls_handler' should return a value [-Wreturn-type] Log 812171
radare 1:1.5.2-4dump.c:124:4: error: non-void function 'process_dump' should return a value [-Wreturn-type] Log
ratfor 1.0-15rat4.c:367:3: error: non-void function 'balpar' should return a value [-Wreturn-type] Log 812169
scrollz 2.1-1.1screen.c:2003:3: error: non-void function 'add_to_screen' should return a value [-Wreturn-type] Log 760678
skyeye 1.2.5-2.1common/armsupp.c:696:3: error: non-void function 'ARMul_MRC' should return a value [-Wreturn-type] Log 812168
slashem 0.0.7E7F3-3../win/gtk/gtkmap.c:618:5: error: non-void function 'nh_set_map_font' should return a value [-Wreturn-type] Log 741371
sniffit 0.3.7.beta-15.1sniffit.0.3.7.c:1096:5: error: non-void function 'packethandler' should return a value [-Wreturn-type] Log
socks4-server 4.3.beta2-18Rconnect.c:124:3: error: non-void function 'SOCKSinit' should return a value [-Wreturn-type] Log
spacearyarya 1.0.2-7ranking.c:18:5: error: non-void function 'ScoreRanking' should return a value [-Wreturn-type] Log 812158
spectools 201108r1-1spectool_raw.c:104:4: error: non-void function 'main' should return a value [-Wreturn-type] Log 741113
tcm 2.20+TSQD-4.2text2ps.c:464:5: error: non-void function 'print_file' should return a value [-Wreturn-type] Log 745652
tcp-wrappers 7.6.q-22fix_options.c:65:2: error: non-void function 'fix_options' should return a value [-Wreturn-type] Log 710391
texlive-bin 2009-11../../../texk/ps2pkm/type1.c:783:8: error: non-void function 'PSFakePop' should return a value [-Wreturn-type] Log
uanytun 0.3.3-1udp.c:261:5: error: non-void function 'udp_endpoint_to_string' should return a value [-Wreturn-type] Log 745643
vftool 2.0alpha-4.1mka2bkjvf.c:175:2: error: non-void function 'vfchar' should return a value [-Wreturn-type] Log 812148
wmshutdown 0.2-5wmShutdown.c:101:13: error: non-void function 'button_press' should return a value [-Wreturn-type] Log 740964
xbs 0-8xbs.c:246:5: error: non-void function 'close_print' should return a value [-Wreturn-type] Log 710387
xfce4-clipman-plugin 2:1.2.2-1collector.c:157:3: error: non-void function 'cb_check_primary_clipboard' should return a value [-Wreturn-type] Log
yardradius 1.1.2-4radtest.c:484:3: error: non-void function 'main' should return a value [-Wreturn-type] Log 740197
ykclient 2.6-1../ykclient_server_response.c:280:5: error: non-void function 'ykclient_server_response_parse' should return a value [-Wreturn-type] Log
63 errors
Return to the list