Debian Package rebuild

Rebuild of the Debian archive with clang

"non-void function should return a value" build failure(s)
clang 3.5.0
Return to the list
With the command
clang -c -Werror plop.c
the code
int myFunction() {
	return;
}
is rejected by clang while accepted with gcc.
Versions: 2.9 - 3.0 - 3.1 - 3.2 - 3.3 - 3.4 - 3.4.2 - 3.5.0 - 3.6.0 - 3.8.1
PackageVersionSupposed error messageFull log Bug report
acm 5.0-28disscope.c:175:2: error: non-void function 'main' should return a value [-Wreturn-type] Log 740019
afpfs-ng 0.8.1-5loop.c:90:14: error: non-void function 'just_end_it_now' should return a value [-Wreturn-type] Log 740023
alliance 5.0-20120515-6elp.c:252:1: error: non-void function 'elpLotrsShrink' should return a value [-Wreturn-type] Log
appstream 0.7.0-2as-metadata.c:322:2: error: non-void function 'as_metadata_parse_upstream_description_tag' should return a value [-Wreturn-type] Log 760654
autolog 0.40-13.1autolog.c:358:2: error: non-void function 'save_users' should return a value [-Wreturn-type] Log 740031
birdfont 0.47-1build/libbirdfont/TabBar.c:1611:2: error: non-void function 'bird_font_tab_bar_has_scroll' should return a value [-Wreturn-type] Log
bluemon 1.4-6bluetooth-monitor.c:299:10: error: non-void function 'get_link_qual' should return a value [-Wreturn-type] Log 740036
bognor-regis 0.6.12+git20101007.02c25268-9bognor-upnp-cp.c:117:9: error: non-void function 'make_device_description' should return a value [-Wreturn-type] Log 740037
camlimages 1:4.0.1-8jpegread.c:420:3: error: non-void function 'read_jpeg_scanlines' should return a value [-Wreturn-type] Log
dico 2.2-5tree.c:1044:4: error: non-void function 'node_reduce' should return a value [-Wreturn-type] Log
dvi2dvi 2.0alpha-9.2dviconv.c:119:7: error: non-void function 'dviconv' should return a value [-Wreturn-type] Log 741135
dvi2ps 5.1j-1.1virfont.c:320:2: error: non-void function 'vf_mc' should return a value [-Wreturn-type] Log 760387
dx 1:4.4.4-7lock.c:939:2: error: non-void function 'DXunlock' should return a value [-Wreturn-type] Log 743003
dynalogin 1.0.0-3dynalogind.c:79:3: error: non-void function 'read_line' should return a value [-Wreturn-type] Log 743004
elmerfem 6.1.0.svn.5396.dfsg2-4fft.c:473:9: error: non-void function 'FFTInit' should return a value [-Wreturn-type] Log
fairymax 4.8q-2fairymax.c:476:20: error: non-void function 'LoadGame' should return a value [-Wreturn-type] Log 743008
freesci 0.6.4-7.2core.c:916:3: error: non-void function 'sfx_send_midi' should return a value [-Wreturn-type] Log
freetuxtv 0.6.5~dfsg1-1gtk-libvlc-instance.c:152:3: error: non-void function 'gtk_libvlc_instance_new' should return a value [-Wreturn-type] Log 744785
gamin 0.1.10-4.1gam_eq.c:127:3: error: non-void function 'gam_eq_flush' should return a value [-Wreturn-type] Log 743699
gbatnav 1.0.4cvs20051004-5play.c:509:3: error: non-void function 'lookup_funcion' should return a value [-Wreturn-type] Log 743696
geki2 2.0.3-8ranking.c:18:5: error: non-void function 'ScoreRanking' should return a value [-Wreturn-type] Log
geki3 1.0.3-7ranking.c:18:5: error: non-void function 'ScoreRanking' should return a value [-Wreturn-type] Log
gfpoken 0.32-2main.c:681:3: error: non-void function 'leveldraw_drag_end' should return a value [-Wreturn-type] Log
gnome-boxes 3.12.3-1installer-media.vala:63:3: error: non-void function 'boxes_installer_media_construct_for_path_finish' should return a value [-Wreturn-type] Log
gpiv 0.6.1-2.3../../../src/display_intregs.c:142:5: error: non-void function 'create_intreg_data' should return a value [-Wreturn-type] Log
gramophone2 0.8.13a-3midifile.c:159:3: error: non-void function 'readheader' should return a value [-Wreturn-type] Log 760662
grcm 0.1.6-1callbacks.c:134:4: error: non-void function 'on_ConnectionsWindow_delete_event' should return a value [-Wreturn-type] Log 760664
gtimer 2.0.0-1.2custom-list.c:613:3: error: non-void function 'custom_list_append_record' should return a value [-Wreturn-type] Log 743313
hpsockd 0.17v5.c:162:3: error: non-void function 'v5Request' should return a value [-Wreturn-type] Log
ibus-m17n 1.3.4-3setup.c:431:9: error: non-void function 'save_m17n_options' should return a value [-Wreturn-type] Log 743129
ircp-tray 0.7.6-1.1sendfile.c:118:3: error: non-void function 'send_session_new' should return a value [-Wreturn-type] Log 743127
jabberd2 2.2.17-1out.c:630:9: error: non-void function 'out_packet' should return a value [-Wreturn-type] Log 742748
jbofihe 0.38-5.1compdfa.c:321:19: error: non-void function 'compress_dfa' should return a value [-Wreturn-type] Log
kannel-sqlbox 0.7.2-3sqlbox_sqlite3.c:114:9: error: non-void function 'sqlite3_fetch_msg' should return a value [-Wreturn-type] Log 742733
kprinter4 12-1postscriptdocument.h:100:120: error: control may reach end of non-void function [-Werror,-Wreturn-type] Log
latencytop 0.5fsync.c:66:4: error: non-void function 'chain_file' should return a value [-Wreturn-type] Log 760285
ldapvi 1.7-9ldapvi.c:1468:30: error: non-void function 'copy_sasl_output' should return a value [-Wreturn-type] Log 760286
libace-perl 1.92-3RPC.xs:157:6: error: non-void function 'constant' should return a value [-Wreturn-type] Log
libctapimkt 1.0.5~rc1-2mktlin.c:340:1: error: non-void function 'antwort' should return a value [-Wreturn-type] Log 742534
libgpiv 0.6.1-4.1../../../lib/io_raw.c:261:5: error: non-void function 'gpiv_fwrite_raw_image' should return a value [-Wreturn-type] Log
libgraphics-libplot-perl 2.2.2-6Libplot.xs:91:6: error: non-void function 'constant' should return a value [-Wreturn-type] Log
libitl-gobject 0.2-1itl-gobject.c:657:3: error: non-void function 'itl_prayer_getPrayerTimes' should return a value [-Wreturn-type] Log 742434
libjogl2-java 2.1.5-1 [cc] /«PKGBUILDDIR»/src/newt/native/bcm_vc_iv.c:360:8: error: non-void function 'Java_jogamp_newt_driver_bcm_vc_iv_WindowDriver_CreateWindow0' should return a value [-Wreturn-type] Log 760294
libmail-cclient-perl 1.12-11Cclient.xs:1031:2: error: non-void function 'mm_diskerror' should return a value [-Wreturn-type] Log 742431
libskk 1.0.0-1state.c:1563:6: error: non-void function 'skk_state_expand_numeric_references' should return a value [-Wreturn-type] Log 742214
libterralib 4.3.0-1../../../src/terralib/kernel/Gra_algo.h:190:2: error: non-void function 'topoSort' should return a value [-Wreturn-type] Log 746608
libvisual-plugins 0.4.0.dfsg.1-7morph_flash.c:119:3: error: non-void function 'lv_morph_flash_palette' should return a value [-Wreturn-type] Log 742210
linsmith 0.99.21-1element.c:313:16: error: non-void function 'clear_element_lnlist' should return a value [-Wreturn-type] Log 760668
linux86 0.16.17-3.1tok_io.c:231:6: error: non-void function 'do_control' should return a value [-Wreturn-type] Log
listaller 0.5.8-2database-internal.c:941:2: error: non-void function 'listaller_internal_db_real_open_rw' should return a value [-Wreturn-type] Log 742144
lwipv6 1.5a-2../../../../ports/unix/netif/vdeif.c:485:3: error: non-void function 'vdeif_streampkt_input' should return a value [-Wreturn-type] Log
macopix 1.7.4-5callbacks.c:541:40: error: non-void function 'MoveToFocus' should return a value [-Wreturn-type] Log 742141
makejvf 1.1a+0-2write.c:123:4: error: non-void function 'writevf' should return a value [-Wreturn-type] Log
medusa 2.1.1-1medusa.c:1570:5: error: non-void function 'startLoginThreadPool' should return a value [-Wreturn-type] Log
mendexk 2.6e-3.2fread.c:552:5: error: non-void function 'chkpageattr' should return a value [-Wreturn-type] Log
micropolis-activity 0.0.20071228-7tclenv.c:298:2: error: non-void function 'unsetenv_tcl' should return a value [-Wreturn-type] Log 741766
moria 5.6.debian.1-1signals.c:139:7: error: non-void function 'signal_handler' should return a value [-Wreturn-type] Log
mtink 1.0.16-8mainSrc/rdRes.c:605:19: error: non-void function 'searchCmp' should return a value [-Wreturn-type] Log 742063
ncbi-seg 0.0.20000620-1seg.c:133:17: error: non-void function 'getparams' should return a value [-Wreturn-type] Log 742060
ncbi-tools6 6.1.20120620-7ncbimisc.c:1269:22: error: non-void function 'MergeStringArray' should return a value [-Wreturn-type] Log
ncl 6.2.0-2.1main.c:121:6: error: non-void function 'getargs' should return a value [-Wreturn-type] Log
ng 1.5~beta1-3tty.c:284:3: error: non-void function 'ttinsl' should return a value [-Wreturn-type] Log 760672
notebook 0.2rel-2.2ui/nb_ui_interface_callbacks.c:80:3: error: non-void function 'nb_ui_cb_on_quit_clicked' should return a value [-Wreturn-type] Log
openjdk-6 6b32-1.13.4-4thread.c:621:9: error: non-void function 'detachThread' should return a value [-Wreturn-type] Log
openmama 2.2.2.1-10mamajni.c:930:20: error: non-void function 'Java_com_wombat_mama_Mama_getProperty' should return a value [-Wreturn-type] Log
orville-write 2.55-2.3wrt_hist.c:92:3: error: non-void function 'put_hist' should return a value [-Wreturn-type] Log 760674
pd-ggee 0.26-3gui/w_envgen.h:456:14: error: non-void function 'envgen_newclick' should return a value [-Wreturn-type] Log 743738
pd-unauthorized 0.1-1countund.c:83:9: error: non-void function 'countund_limit' should return a value [-Wreturn-type] Log 743737
python-srp 1.0.4-1srp/_srp.c:1506:9: error: non-void function 'init_srp' should return a value [-Wreturn-type] Log
radare 1:1.5.2-6dump.c:124:4: error: non-void function 'process_dump' should return a value [-Wreturn-type] Log
ratfor 1.0-15rat4.c:367:3: error: non-void function 'balpar' should return a value [-Wreturn-type] Log 812169
rplay 3.3.2-14mailsound.c:157:3: error: non-void function 'compare' should return a value [-Wreturn-type] Log 741567
scalapack 1.8.0-9.2pslaiect.c:209:7: error: non-void function 'pslachkieee_' should return a value [-Wreturn-type] Log 710395
scottfree 1.14-9ScottCurses.c:1167:7: error: non-void function 'PerformActions' should return a value [-Wreturn-type] Log 760675
scrollz 2.1-1.2screen.c:2003:3: error: non-void function 'add_to_screen' should return a value [-Wreturn-type] Log 760678
sdl-mixer1.2 1.2.12-11music_mad.c:227:2: error: non-void function 'mad_getSamples' should return a value [-Wreturn-type] Log 741373
skyeye 1.2.5-4common/armsupp.c:696:3: error: non-void function 'ARMul_MRC' should return a value [-Wreturn-type] Log 812168
snack 2.2.10.20090623-dfsg-4./../generic/SnackMpg.c:337:9: error: non-void function 'CloseMpg123File' should return a value [-Wreturn-type] Log
sniffit 0.3.7.beta-17sniffit.0.3.7.c:1096:5: error: non-void function 'packethandler' should return a value [-Wreturn-type] Log
spacearyarya 1.0.2-7ranking.c:18:5: error: non-void function 'ScoreRanking' should return a value [-Wreturn-type] Log 812158
spectools 201108r1-3spectool_raw.c:104:4: error: non-void function 'main' should return a value [-Wreturn-type] Log 741113
squeak-vm 1:4.10.2.2614-1sqUnixSoundPulseAudio.c:998:21: error: non-void function 'sound_StopRecording' should return a value [-Wreturn-type] Log 740972
sugar-datastore-0.84 0.84.1-3.1metadatareader.c:33:9: error: non-void function 'add_property' should return a value [-Wreturn-type] Log
sundials 2.5.0-3kim.c:682:24: error: non-void function 'KIM_Stats' should return a value [-Wreturn-type] Log 812157
symmetrica 2.0-1part.c:1770:15: error: non-void function 'rec01' should return a value [-Wreturn-type] Log
tcm 2.20+TSQD-4.4text2ps.c:464:5: error: non-void function 'print_file' should return a value [-Wreturn-type] Log 745652
tdfsb 0.0.10-1.1tdfsb.c:2798:33: error: non-void function 'keyboard' should return a value [-Wreturn-type] Log 745645
ucblogo 5.5-2.1graphics.c:556:5: error: non-void function 'lshowturtle' should return a value [-Wreturn-type] Log
uniutils 2.27-2unifuzz.c:109:44: error: non-void function 'EmitAllRanges' should return a value [-Wreturn-type] Log 740968
unrtf 0.21.5-1attr.c:352:3: error: non-void function 'attr_get_param' should return a value [-Wreturn-type] Log 740966
vftool 2.0alpha-4.1mka2bkjvf.c:175:2: error: non-void function 'vfchar' should return a value [-Wreturn-type] Log 812148
xbs 0-8xbs.c:246:5: error: non-void function 'close_print' should return a value [-Wreturn-type] Log 710387
xgks 2.6.1+dfsg.2-2input.c:209:2: error: non-void function 'XgksIProcessXEvent' should return a value [-Wreturn-type] Log 740871
xpilot-ng 1:4.7.3-2.1suibotdef.c:408:5: error: non-void function 'Get_object_proximity' should return a value [-Wreturn-type] Log 740671
ygraph 0.16~cvs20090218-1.2axis.c:976:5: error: non-void function 'range_reset' should return a value [-Wreturn-type] Log 740624
z88dk 1.8.ds1-10cpp2.c:339:9: error: non-void function 'doif' should return a value [-Wreturn-type] Log 812152
96 errors
Return to the list