Debian Package rebuild

Rebuild of the Debian archive with clang

"Conflicting declaration" build failure(s)
clang 3.1
Return to the list

Versions: 2.9 - 3.0 - 3.1 - 3.2 - 3.3 - 3.4 - 3.4.2 - 3.5.0 - 3.6.0 - 3.8.1
PackageVersionSupposed error messageFull log Bug report
aprsd 1:2.2.5-13-5.2cstring:101:3: error: declaration conflicts with target of using declaration already in scope Log
biosig4c++ 1.3.0-2cstdlib:139:3: error: declaration conflicts with target of using declaration already in scope Log
gdc-4.6 0.29.1-4.6.3-1cstring:101:3: error: declaration conflicts with target of using declaration already in scope Log
mwrap 0.33-1cstdlib:139:3: error: declaration conflicts with target of using declaration already in scope Log
octave-nan 2.5.5-2cstdlib:139:3: error: declaration conflicts with target of using declaration already in scope Log
octave-tsa 4.2.4-1cstdlib:139:3: error: declaration conflicts with target of using declaration already in scope Log
psychtoolbox-3 3.0.9+svn2579.dfsg1-1cstdlib:139:3: error: declaration conflicts with target of using declaration already in scope Log
7 errors
Return to the list