Debian Package rebuild

Rebuild of the Debian archive with clang

"Some files are gone in the process" build failure(s)
clang 3.1
Return to the list

Versions: 2.9 - 3.0 - 3.1 - 3.2 - 3.3 - 3.4 - 3.4.2 - 3.5.0 - 3.6.0 - 3.8.1
PackageVersionSupposed error messageFull log Bug report
anjuta 2:3.4.3-1ld: cannot find /usr/bin/../lib/libprofile_rt.a: No such file or directory Log
chrony 1.26-1cp: cannot stat `faq.html': No such file or directory Log
cowdancer 0.70cow-shell unlink .ilist: No such file or directory Log
dragonegg 3.0-3.2g++-4.6: error: directory": No such file or directory Log
gcc-avr 1:4.7.0-2bash: debian/runcheck.sh: No such file or directory Log
gnunet 0.9.3-1cp: cannot stat `debian/tmp/usr/lib/libnss_gns.so.2': No such file or directory Log
graphviz 2.26.3-11cp: cannot stat `debian/tmp/usr/lib/graphviz/ruby/libgv_ruby.so': No such file or directory Log
ir.lv2 1.3.1~dfsg0-3clang: error: no such file or directory: 'nodelete' Log
kalgebra 4:4.7.4-2cp: cannot stat `debian/tmp/usr/lib/libanalitza.so.4.7.0': No such file or directory Log
kdeutils 4:4.7.4-2cp: cannot stat `debian/tmp/usr/lib/libkerfuffle.so.4.7.0': No such file or directory Log
kst 2.0.3-1.2clang: error: no such file or directory: '/FI/«PKGBUILDDIR»/obj-x86_64-linux-gnu/src/libkst/kstcore_pch.h' Log
langscan 1.2+cvs20070125-1/usr/bin/install: cannot stat `./c.': No such file or directory Log
libembperl-perl 2.3.0-2cat: test/tmp/httpd.pid: No such file or directory Log
libgcal 0.9.6-3ld: cannot find /usr/bin/../lib/libprofile_rt.a: No such file or directory Log
libpam-unix2 1:2.4.1-6clang: error: no such file or directory: 'pam_unix2.so' Log
libusb-java 0.8+ztex20090101-4cp: cannot create regular file `/«BUILDDIR»/libusb-java-0.8+ztex20090101/debian/libusb-java/usr/share/java/': No such file or directory Log
littler 0.1.5-1ld: cannot find relro: No such file or directory Log
notify-osd 0.9.34-2ld: cannot find /usr/bin/../lib/libprofile_rt.a: No such file or directory Log
novnc 2012.1~e3+dfsg+1-2cp: cannot stat `debian/tmp/utils/rebind.so': No such file or directory Log
obrowser 1.1.1+dfsg-1clang: error: no such file or directory: 'vm.js' Log
ogre 1.7.4-5open: No such file or directory Log
openvas-plugins-dfsg 1:20100705-4cp: cannot create regular file `debian/openvas-plugins-dfsg/usr/share/lintian/overrides/openvas-plugins-dfsg': No such file or directory Log
scilab-jims 1.1-1cp: cannot stat `/«PKGBUILDDIR»/sci_gateway/c/loader.sce': No such file or directory Log
scilab-overload 1.3.3-3cp: cannot stat `src/liboverload.so': No such file or directory Log
scilab-scimax 2.1.4-2cp: cannot stat `src/c/libmaxima.so': No such file or directory Log
scilab-scimysql 0.1.1-5cp: cannot stat `./sci_gateway/loader_gateway.sce': No such file or directory Log
sugar-hulahop 0.8.1-1/bin/bash: /usr/lib/xulrunner-devel-10.0/bin/xpidl: No such file or directory Log
tora 2.1.3-2clang: error: no such file or directory: '/c' Log
uw-imap 8:2007e~dfsg-3.3install: cannot stat `c-client.a': No such file or directory Log
xcircuit 3.7.40.dfsg-1ld: cannot find defs: No such file or directory Log
xscreensaver 5.15-2cp: cannot stat `debian/tmp/etc/X11/app-defaults/XScreenSaver': No such file or directory Log
31 errors
Return to the list