Debian Package rebuild

Rebuild of the Debian archive with clang

"Some files are gone in the process" build failure(s)
clang 3.8.1
Return to the list

Versions: 2.9 - 3.0 - 3.1 - 3.2 - 3.3 - 3.4 - 3.4.2 - 3.5.0 - 3.6.0 - 3.8.1
PackageVersionSupposed error messageFull log Bug report
adacgi 1.6-19.1clang: error: unable to execute command: No such file or directory Log
cxref 1.6e-2mv: cannot stat 'README.c.tex': No such file or directory Log
freeipmi 1.4.11-1clang: error: no such file or directory: 'libipmiconsole.3' Log
kst 2.0.3-5clang: error: no such file or directory: '/FI/<>/obj-x86_64-linux-gnu/src/libkst/kstcore_pch.h' Log
libaqbanking 5.6.12-1clang: error: no such file or directory: '@m64' Log
libpam-unix2 1:2.6-2clang: error: no such file or directory: 'pam_unix2.so' Log
ncl 6.3.0-10clang: error: no such file or directory: '1' Log
pacemaker 1.1.15-1rm: cannot remove 'debian/tmp/usr/lib/python2.7/dist-packages/cts': No such file or directory Log
partclone 0.2.88-1diff: f2.obj: No such file or directory Log
perl 5.22.2-3Can't open gnu/stubs-x32.h: No such file or directory Log
pgloader 3.2.2+dfsg-1 error opening #P"/etc/localtime": No such file or directory Log
ruby-augeas 1:0.5.0-3cat: mkmf.log: No such file or directory Log
ruby-libvirt 0.6.0-2cat: mkmf.log: No such file or directory Log
ruby-mysql 2.9.1-1cat: mkmf.log: No such file or directory Log
ruby-rmagick 2.15.4+dfsg-2cat: mkmf.log: No such file or directory Log
15 errors
Return to the list