Debian Package rebuild

Rebuild of the Debian archive with clang

"No support of nested C function" build failure(s)
clang 3.3
Return to the list
clang rejects inner functions while gcc accepts them.
void foo() {

     void bar() {

     }

}

Versions: 2.9 - 3.0 - 3.1 - 3.2 - 3.3 - 3.4 - 3.4.2 - 3.5.0 - 3.6.0 - 3.8.1
PackageVersionSupposed error messageFull log Bug report
aqualung 0.9~beta11-1.2gui_main.c:3237:61: error: function definition is not allowed here Log 746195
auto-multiple-choice 1.2.0-2AMC-traitement-image.c:228:29: error: function definition is not allowed here Log 746196
bogl 0.1.18-9bogl-font.c:84:3: error: function definition is not allowed here Log 758063
elfutils 0.153-2elf_begin.c:1058:3: error: function definition is not allowed here Log 758064
eurephia 1.1.0-4eurephiadm.c:203:47: error: function definition is not allowed here Log
ffindex 0.9.9.1-1ffindex.c:448:3: error: function definition is not allowed here Log 758149
filters 2.49cockney.l:21:13: error: function definition is not allowed here Log 758450
freedroidrpg 0.15.1-1quest_browser_ui.c:609:4: error: function definition is not allowed here Log 758161
gambas3 3.1.1-2.1gb_error.c:93:3: error: function definition is not allowed here Log
gmysqlcc 0.3.0-2gmlc_gui_server_tab_data.c:678:83: error: function definition is not allowed here Log 750365
gpe-calendar 0.92-5calendars-widgets.c:712:5: error: function definition is not allowed here Log
gpsdrive 2.10~pre4-6.dfsg-5.2gpsdrive.c:3384:2: error: function definition is not allowed here Log 758452
kraptor 0.0.20040403-8src/game.c:416:3: error: function definition is not allowed here Log 750370
libeventdb 0.90-5event-db.c:539:5: error: function definition is not allowed here Log
libgpevtype 0.50-6vcal.c:44:5: error: function definition is not allowed here Log
libhandoff 0.1-5handoff.c:258:5: error: function definition is not allowed here Log
libhdate 1.6-1././local_functions.c:673:2: error: function definition is not allowed here Log 758453
libsx 2.05-5popups.c:71:3: error: function definition is not allowed here Log 758560
luvcview 1:0.2.6-6v4l2uvc.c:197:30: error: function definition is not allowed here Log 750506
mandos 1.6.0-1plugin-runner.c:425:66: error: function definition is not allowed here Log 750516
med-fichier 3.0.3-3filterBlockOfentities.c:104:116: error: function definition is not allowed here Log 751174
ncpfs 2.2.6-9ncplib.c:2424:52: error: function definition is not allowed here Log
netplug 1.2.9.2-1if_info.c:294:37: error: function definition is not allowed here Log 750789
p3scan 2:2.3.2-8.1p3scan.c:2418:83: error: function definition is not allowed here Log 750874
pdp 1:0.12.5-2pdp_xwindow.c:148:24: error: function definition is not allowed here Log 758569
rainbow 0.8.6-1nss-rainbow.c:287:39: error: function definition is not allowed here Log 758571
rawstudio 2.0-1.1rs-tag-gui.c:103:2: error: function definition is not allowed here Log
rsh-redone 85-2rlogin.c:388:30: error: function definition is not allowed here Log 750957
slurm-llnl 2.5.7-1dist_tasks.c:306:2: error: function definition is not allowed here Log
smbc 1.2.2-3smbc.c:316:2: error: function definition is not allowed here Log
spl 1.0~pre6-4spl_modules/mod_array.c:160:2: error: function definition is not allowed here Log 741605
upstart 1.6.1-1tests/test_initctl.c:3669:35: error: function definition is not allowed here Log 737757
w-scan 20130331-1descriptors.c:1014:35: error: function definition is not allowed here Log 744323
33 errors
Return to the list