Debian Package rebuild

Rebuild of the Debian archive with clang

"No support of nested C function" build failure(s)
clang 3.4
Return to the list
clang rejects inner functions while gcc accepts them.
void foo() {

     void bar() {

     }

}

Versions: 2.9 - 3.0 - 3.1 - 3.2 - 3.3 - 3.4 - 3.4.2 - 3.5.0 - 3.6.0 - 3.8.1 - 3.9.1 - 4.0.1 - 5.0
PackageVersionSupposed error messageFull log Bug report
altree 1.3.1-1rhyper.c:73:27: error: function definition is not allowed here Log 742843
aqualung 0.9~beta11-2gui_main.c:3237:61: error: function definition is not allowed here Log 746195
auto-multiple-choice 1.2.1-1AMC-traitement-image.c:228:29: error: function definition is not allowed here Log 746196
bogl 0.1.18-9bogl-font.c:84:3: error: function definition is not allowed here Log 758063
elfutils 0.157-3elf_begin.c:1041:3: error: function definition is not allowed here Log 758064
ffindex 0.9.9.3-1ffindex.c:518:3: error: function definition is not allowed here Log 758149
filters 2.49cockney.l:21:13: error: function definition is not allowed here Log 758450
freedroidrpg 0.15.1-1quest_browser_ui.c:609:4: error: function definition is not allowed here Log 758161
gambas3 3.5.1-1gb_error.c:94:3: error: function definition is not allowed here Log
gerris 20110329-dfsg.2-1../../../../doc/examples/modules.c:5:1: error: function definition is not allowed here Log
gmysqlcc 0.3.0-3gmlc_gui_server_tab_data.c:678:83: error: function definition is not allowed here Log 750365
gpsdrive 2.10~pre4-6.dfsg-5.2gpsdrive.c:3384:2: error: function definition is not allowed here Log 758452
gwc 0.21.19~dfsg0-3gwc.c:2667:2: error: function definition is not allowed here Log 750369
kraptor 0.0.20040403-8src/game.c:416:3: error: function definition is not allowed here Log 750370
lasso 2.3.6-3tools.c:1214:77: error: function definition is not allowed here Log
libhdate 1.6-2././local_functions.c:672:2: error: function definition is not allowed here Log 758453
libsx 2.05-5popups.c:71:3: error: function definition is not allowed here Log 758560
litl 0.1.1+dfsg-3litl_write.c:136:17: error: function definition is not allowed here Log 750386
luvcview 1:0.2.6-6v4l2uvc.c:197:30: error: function definition is not allowed here Log 750506
mandos 1.6.0-1plugin-runner.c:425:66: error: function definition is not allowed here Log 750516
matchbox-panel 0.9.3-8.1mb-applet-battery.c:182:2: error: function definition is not allowed here Log 750784
med-fichier 3.0.6-2generateDatas.c:33:38: error: function definition is not allowed here Log 751174
netplug 1.2.9.2-1if_info.c:294:37: error: function definition is not allowed here Log 750789
p3scan 2:2.3.2-8.1p3scan.c:2418:83: error: function definition is not allowed here Log 750874
pdp 1:0.14.1-1pdp_bitmap.c:525:30: error: function definition is not allowed here Log 758569
proot 3.0.2-1./cli.c:315:32: error: function definition is not allowed here Log 750879
qxw 20110923-1dicts.c:288:43: error: function definition is not allowed here Log
rainbow 0.8.7-1nss-rainbow.c:287:39: error: function definition is not allowed here Log 758571
ratpoints 2.1.3+dfsg-2./sturm.c:176:5: error: function definition is not allowed here Log
rsh-redone 85-2rlogin.c:388:30: error: function definition is not allowed here Log 750957
slurm-llnl 2.6.4-1dist_tasks.c:321:2: error: function definition is not allowed here Log
spl 1.0~pre6-4spl_modules/mod_format_xml.c:188:2: error: function definition is not allowed here Log 741605
systemtap 2.3-1loc2c.c:344:5: error: function definition is not allowed here Log
w-scan 20130331-1descriptors.c:1014:35: error: function definition is not allowed here Log 744323
34 errors
Return to the list