Debian Package rebuild

Rebuild of the Debian archive with clang

"Cannot be narrowed" build failure(s)
clang 3.9.1
Return to the list

Versions: 2.9 - 3.0 - 3.1 - 3.2 - 3.3 - 3.4 - 3.4.2 - 3.5.0 - 3.6.0 - 3.8.1 - 3.9.1 - 4.0.1 - 5.0
PackageVersionSupposed error messageFull log Bug report
brainparty 0.61+dfsg-3BPGame.cpp:1506:25: error: non-constant-expression cannot be narrowed from type 'int' to 'GLfloat' (aka 'float') in initializer list [-Wc++11-narrowing] Log
ceph 10.2.5-7.2client/fuse_ll.cc:533:10: error: case value evaluates to 2150143745, which cannot be narrowed to type 'int' [-Wc++11-narrowing] Log 749083
eris 1.3.23-5PollDefault.cpp:80:28: error: non-constant-expression cannot be narrowed from type 'unsigned long' to '__time_t' (aka 'long') in initializer list [-Wc++11-narrowing] Log
eviacam 2.1.1-1crvmisc.cpp:62:7: error: case value evaluates to 2147483680, which cannot be narrowed to type 'int' [-Wc++11-narrowing] Log
extundelete 0.2.4-1extundelete.cc:1271:28: error: non-constant-expression cannot be narrowed from type 'int' to 'ext2_ino_t' (aka 'unsigned int') in initializer list [-Wc++11-narrowing] Log
k3d 0.8.0.6-2seed_rng.hpp:143:35: error: non-constant-expression cannot be narrowed from type 'int' to 'unsigned int' in initializer list [-Wc++11-narrowing] Log
kcm-fcitx 0.5.3-2skinpage.cpp:134:10: error: case value evaluates to 2401319027, which cannot be narrowed to type 'int' [-Wc++11-narrowing] Log
kmplayer 1:0.12.0b-1viewarea.cpp:2538:57: error: non-constant-expression cannot be narrowed from type 'long' to 'uint32_t' (aka 'unsigned int') in initializer list [-Wc++11-narrowing] Log
limesuite 16.12.0+dfsg-1mcu.c:17:46: error: non-constant-expression cannot be narrowed from type 'int' to 'uint16_t' (aka 'unsigned short') in initializer list [-Wc++11-narrowing] Log
magics++ 2.34.0-1CalcStreamlines.cc:194:31: error: non-constant-expression cannot be narrowed from type 'double' to 'float' in initializer list [-Wc++11-narrowing] Log
scidavis 1.D13-1src/Fit.cpp:83:3: error: non-constant-expression cannot be narrowed from type 'int' to 'size_t' (aka 'unsigned long') in initializer list [-Wc++11-narrowing] Log
sdrangelove 0.0.1.20150707-2miniz.cpp:2782:72: error: non-constant-expression cannot be narrowed from type 'char' to 'mz_uint8' (aka 'unsigned char') in initializer list [-Wc++11-narrowing] Log
simutrans 120.2.2-1gui/simwin.cc:503:11: error: case value evaluates to -1, which cannot be narrowed to type 'uint32' (aka 'unsigned int') [-Wc++11-narrowing] Log 750121
vdr-plugin-fritzbox 1.5.3-4notifyosd.cpp:131:23: error: non-constant-expression cannot be narrowed from type 'unsigned int' to 'int' in initializer list [-Wc++11-narrowing] Log
14 errors
Return to the list