Debian Package rebuild

Rebuild of the Debian archive with clang

"Expected declaration (#define missing?)" build failure(s)
clang 10
Return to the list

Versions: 2.9 - 3.0 - 3.1 - 3.2 - 3.3 - 3.4 - 3.4.2 - 3.5.0 - 3.6.0 - 3.8.1 - 3.9.1 - 4.0.1 - 5.0 - 6.0 - 8.0.1 - 9.0.1 - 10
PackageVersionSupposed error messageFull log Bug report
acm 5.0-29.2xdr_var_array.c:83:12: error: expected parameter declarator Log 740019
apt 2.0.2include/apt-pkg/pkgcache.h:102:26: error: expected ';' at end of declaration list Log
apt-move 4.2.27-6pkgcache.h:102:26: error: expected ';' at end of declaration list Log
ats-lang-anairiats 0.2.11-1bool.cats:42:5: error: expected parameter declarator Log
ats2-lang 0.4.0-1./prelude/CATS/integer.cats:42:5: error: expected parameter declarator Log
ccextractor 0.87+ds1-1../src/lib_ccx/utility.h:41:5: error: expected parameter declarator Log
chasen 2.4.5-44print.c:186:16: error: expected parameter declarator Log
dcap 2.47.12-2./util.h:14:12: error: expected parameter declarator Log 755964
deepin-deb-installer 5.0.0-1pkgcache.h:102:26: error: expected ';' at end of declaration list Log
gr-iqbal 0.38-4cxvec.h:45:15: error: expected ';' at end of declaration list Log
gtg-trace 0.2-2+dfsg-6C/paje_GTGBasic1_c.c:14:12: error: expected parameter declarator Log
libapt-pkg-perl 0.1.36pkgcache.h:102:26: error: expected ';' at end of declaration list Log
libept 1.2pkgcache.h:102:26: error: expected ';' at end of declaration list Log
libesmtp 1.0.6-4.3./missing.h:48:5: error: expected parameter declarator Log
libfiu 1.00-7modules/posix.custom.c:445:42: error: expected parameter declarator Log
libqapt 3.0.5-1pkgcache.h:102:26: error: expected ';' at end of declaration list Log
libqb 1.0.5-1_syslog_override.c:#define add_tcase_select(cnt) JOIN(add_tcase_, cnt)45:6: error: expected parameter declarator Log
muon 4:5.8.0-1pkgcache.h:102:26: error: expected ';' at end of declaration list Log
nvptx-tools 0.20180301-1./../include/libiberty.h:627:12: error: expected parameter declarator Log
pchar 1.5-4./pc.h:28:15: error: expected identifier Log
pgtop 3.7.0-18-gbbf1f12-3./c.h:761:1: error: expected parameter declarator Log
python-apt 2.1.3pkgcache.h:102:26: error: expected ';' at end of declaration list Log
sdpa 7.3.14+dfsg-1mexFprintf.c:32:5: error: expected parameter declarator Log
snap-aligner 1.0~beta.18+dfsg-3SNAPLib/AlignerContext.cpp:341:34: error: expected ')' Log
suricata 1:5.0.3-1llcllc: error: llc: filter.ll:19:53: error: expected ')' at end of argument list Log
synaptic 0.90+nmu1pkgcache.h:102:26: error: expected ';' at end of declaration list Log
urjtag 0.10+r2007-1.2../../include/libiberty.h:589:12: error: expected parameter declarator Log
27 errors
Return to the list