Debian Package rebuild

Rebuild of the Debian archive with clang

"Not categorized" build failure(s)
clang 11.0.0
Return to the list

Versions: 2.9 - 3.0 - 3.1 - 3.2 - 3.3 - 3.4 - 3.4.2 - 3.5.0 - 3.6.0 - 3.8.1 - 3.9.1 - 4.0.1 - 5.0 - 6.0 - 8.0.1 - 9.0.1 - 10.0.0 - 11.0.0
PackageVersionSupposed error messageFull log Bug report
0ad 0.0.23.1-5../../build/unix/gold/ld: error: hidden symbol 'ceil' is not defined locally Log
3dchess 0.8.1-20Undetected errorLog
aconnectgui 0.9.0rc2-1-10configure: error: Sufficiently new version of libasound not found. Log 684508
acpid 1:2.0.32-1configure: error: "asprintf() not found" Log
adun.app 0.81-14 Log
altermime 0.3.10-12Undetected errorLog 753058
android-platform-libnativehelper 8.1.0+r23-1ld: final link failed: bad value Log
aplus-fsf 4.22.1-10.1configure: error: in `/<>' Log
apophenia 1.0+ds-8 Log
apron 0.9.10-9.1ppl.hh:66465:8: error: missing 'typename' prior to dependent type template name 'OR_Matrix::Pseudo_Row' Log
aptitude 0.8.13-2../../../../src/generic/problemresolver/problemresolver.h:1725:17: error: use of non-static data member 'graph' of 'generic_problem_resolver' from nested type 'do_process_promotion' Log
arj 3.10.22-23Undetected errorLog
armnn 19.11.1-1Layer.hpp:96:17: error: explicitly defaulted move assignment operator is implicitly deleted [-Werror,-Wdefaulted-function-deleted] Log
auto-07p 0.9.2+dfsg-3configure: error: COIN3D is not installed Log
autodocksuite 4.2.6-7configure: error: in `/<>/autodock' Log
avifile 1:0.7.48~20090503.ds-21common/avm_output.cpp:20:12: error: qualified reference to 'AvmOutput' is a constructor name rather than a type in this context Log
ball 1.5.0+git20180813.37fc53c-6Undetected errorLog 755225
bcachefs-tools 0.1+git20201025.742dbbdb-1libbcachefs/bset.c:1197:6: error: unknown token in expression Log
bedops 2.4.39+dfsg-1../../../../interfaces/general-headers/utility/BitMonitor.hpp:89:19: error: cannot assign to non-static data member within const member function 'next_set' Log
belr 0.1.3-2new_allocator.h:156:4: error: destructor called on non-final 'belr::ParserHandler, std::shared_ptr >' that has virtual functions but non-virtual destructor [-Werror,-Wdelete-non-abstract-non-virtual-dtor] Log
bind-dyndb-ldap 11.5-1../../src/ldap_driver.c:136:2: error: address argument to atomic operation must be a pointer to _Atomic type ('isc_refcount_t *' (aka 'unsigned long *') invalid) Log
binutils-djgpp 2.34+dfsg-1Undetected errorLog
binutils-mingw-w64 8.11Undetected errorLog
binutils-mipsen 6+c1Undetected errorLog
blitz++ 1:1.0.2+ds-2 Log
bmusb 0.7.5-1bmusb.cpp:641:16: error: 'target' attribute takes one argument Log
boost1.71 1.71.0-7dh_install: error: missing files, aborting Log
busybox 1:1.30.1-6Undetected errorLog
ccls 0.20201025-1dh_auto_configure: error: cd obj-x86_64-linux-gnu && cmake -DCMAKE_INSTALL_PREFIX=/usr -DCMAKE_BUILD_TYPE=None -DCMAKE_INSTALL_SYSCONFDIR=/etc -DCMAKE_INSTALL_LOCALSTATEDIR=/var -DCMAKE_EXPORT_NO_PACKAGE_REGISTRY=ON -DCMAKE_FIND_PACKAGE_NO_PACKAGE_REGISTRY=ON -DCMAKE_INSTALL_RUNSTATEDIR=/run -DCMAKE_SKIP_INSTALL_ALL_DEPENDENCY=ON "-GUnix Makefiles" -DCMAKE_VERBOSE_MAKEFILE=ON -DCMAKE_INSTALL_LIBDIR=lib/x86_64-linux-gnu -DCCLS_VERSION=0.20201025-1 -DCLANG_RESOURCE_DIR=/usr/include/clang/10 .. returned exit code 1 Log
clfft 2.12.2-1dh_install: error: missing files, aborting Log
collectd 5.11.0-7configure: error: strtok_r is not available. Please file a bugreport! Log 758481
comptty 1.0.1-4comp_tty.cxx:27:30: error: character too large for enclosing character literal type Log
coz-profiler 0.2.2-2data.hh:558:22: error: cannot assign to non-static data member within const member function 'set_binding' Log
cpl-plugin-muse 2.8.3+dfsg-1muse_lsf.c:219:8: error: loop iteration variable in the associated loop of 'omp parallel for' directive may not be shared, predetermined as private Log
cpp-hocon 0.3.0-1new_allocator.h:156:4: error: destructor called on non-final 'hocon::config_delayed_merge_object' that has virtual functions but non-virtual destructor [-Werror,-Wdelete-non-abstract-non-virtual-dtor] Log
crash 7.2.8-1Undetected errorLog
crawl 2:0.25.1-1Undetected errorLog
cubemap 1.4.3-1 Log
dbuskit 0.1.1-3configure: error: "could not find runtime.h. DBusKit requires gnustep-base >=1.20." Log
ddcutil 0.9.9-2vcp_feature_codes.c:3606:20: error: initializer overrides prior initialization of this subobject [-Werror,-Winitializer-overrides] Log
diagnostics 0.3.3-12marshaling.cpp:77:2: error: 'delete' applied to a pointer that was allocated with 'new[]'; did you mean 'delete[]'? [-Werror,-Wmismatched-new-delete] Log 751904
dicom3tools 1.00~20190724083540-1 Log
digikam 4:6.4.0+dfsg-3cv_image.h:128:18: error: no viable conversion from 'const cv::Mat' to 'IplImage' (aka '_IplImage') Log
directfb 1.7.7-9./String.h:126:51: error: format argument not a string type Log
dlm 4.0.9-2Undetected errorLog
dnsdbq 2.3.0-1netio.c:349:4: error: ignoring return value of function declared with 'warn_unused_result' attribute [-Werror,-Wunused-result] Log
doomsday 2.2.2+ds1-1Undetected errorLog
dpuser 4.0+dfsg-2Undetected errorLog
dynare 4.6.2-1local_state_space_iteration_2.cc:97:35: error: reference to local binding 'ii1' declared in enclosing function 'ss2Iteration_pruning' Log
efibootmgr 17-1make[3]: *** No rule to make target 'efivar.h', needed by 'efibootmgr.o'. Stop. Log 753644
efitools 1.9.2-1Undetected errorLog
elfutils 0.181-1configure: error: gcc with GNU99 support required Log 758064
elpa 2019.11.001-4clang: error: unable to execute command: Aborted Log
esys-particle 2.3.5+dfsg2-1./SphAggGougeBlock.hpp:39:37: error: no viable conversion from '__normal_iterator, std::allocator > >::const_pointer, [...]>' to '__normal_iterator, std::allocator > >::pointer, [...]>' Log
etoile 0+20080616+dfsg-2 Log
exodusii 6.02.dfsg.1-8 Log
facter 3.14.12-1new_allocator.h:156:4: error: destructor called on non-final 'facter::facts::external::text_resolver' that has virtual functions but non-virtual destructor [-Werror,-Wdelete-non-abstract-non-virtual-dtor] Log
fflas-ffpack 2.4.3-2configure: error: The Givaro library could not be used with the compiler and the flags set up by the configure script Log
fftw3 3.3.8-2configure: error: gcc 4.6 or later required for quad precision support Log
firebird3.0 3.0.7.33374.ds4-1libtool.m4: error: problem compiling CXX test program Log
gbsplay 0.0.93-3Undetected errorLog
gcc-avr 1:5.4.0+Atmel3.6.1-2Undetected errorLog
gcc-mingw-w64 23configure: error: GNAT is required to build ada Log
gcc-xtensa-lx106 7Undetected errorLog
gcl 2.6.12-98 Log
gdb-avr 7.7-4Undetected errorLog
gdb-mingw-w64 10.9Undetected errorLog
generator-scripting-language 4.1.5-3Undetected errorLog
getfem++ 5.3+dfsg1-3configure: error: g++ do not support option -std=c++11. Update g++ to at least release 4.8.1. Log
gforth 0.7.3+dfsg-9Undetected errorLog
gnustep-base 1.27.0-3configure: error: Could not find Objective-C headers Log
golang-1.15 1.15.2-1 Log
gpg-remailer 3.04.05-1mail/../cleartextmail/../mailer/send.f:11:17: error: cannot cast 'Mailer' to its private base class 'MailerBase' Log
gr-radar 0.0.0.20180308-4(./refman.out) (./refman.out)/<>/lib/signal_generator_cw_c_impl.cc:89:29: error: implicit conversion from '_Complex double' to 'float' is not permitted in C++ Log
granule 1.4.0-7-9 Log
gromacs 2020.4-2Undetected errorLog
grub 0.97-76configure: error: GRUB requires GAS .code16 addr32 support; upgrade your binutils Log
gyoto 1.4.4-3configure: error: MPI requested but not found Log
haskell-alsa-mixer 0.3.0-2Undetected errorLog
haskell-thyme 0.3.5.5-5Undetected errorLog
helpviewer.app 0.3-8clang: error: invalid value 'ISO-8859-1' in '-finput-charset=ISO-8859-1' Log
htslib 1.11-2configure: error: in `/<>' Log
hugs98 98.200609.21-5.4tools/make_bootlib: 68: -D__HUGS__: not found Log
hylafax 3:6.0.7-3Undetected errorLog
imvirt 0.9.6-6vmware.c:65:5: error: invalid operand for instruction Log
insighttoolkit4 4.13.3withdata-dfsg1-2itkBalloonForceFilter.hxx:1091:18: error: assigning to 'float **' from incompatible type 'void *' Log
itksnap 3.6.0-5 Log
ivtools 2.0.4a1-1Undetected errorLog
js8call 2.2.0+ds-1f95: error: unrecognized command-line option ‘-fopenmp=libomp’; did you mean ‘-fopenmp-simd’? Log
krita 1:4.4.0+dfsg-1intrinsics.h:601:13: error: argument to '__builtin_ia32_vec_ext_v4sf' must be a constant integer Log
lam 7.1.4-6configure: error: *** Cannot continue. Log
lammps 20200303+dfsg1-3lal_lj_tip4p_long.cpp:386:16: error: explicit instantiation of 'LAMMPS_AL::LJ_TIP4PLong' must occur in namespace 'LAMMPS_AL' Log
lastz 1.04.03-4Undetected errorLog
libdbi-drivers 0.9.0-9Undetected errorLog
libdfp 1.0.15-2configure: error: Building Libdfp requires a GLIBC printf.h header that Log
libelfin 0.3-2./data.hh:558:22: error: cannot assign to non-static data member within const member function 'set_binding' Log
libgetdata 0.10.0-9Undetected errorLog
libinfinity 0.7.1-5 Log 742437
libkkc 0.3.5-7Undetected errorLog
libktorrent 2.2.0-2Undetected errorLog
liblemon 1.3.1+dfsg-4path.h:231:24: error: no viable conversion from 'typename PredMapPath >::RevArcIt' to 'std::vector >::value_type' (aka 'lemon::concepts::Digraph::Arc') Log
libmath-mpfr-perl 4.14-1have_d64.in:2:2: error: GNU decimal type extension not supported Log
libmdsp 0.11-10src/antoi.c:21:17: error: unknown kind of pragma comment Log
libnftnl 1.1.7-1E: apt-cache returned no information about libnftnl source Log 755956
libpappsomspp 0.8.8-1test_msrunalignment.cpp:191:48: error: 'maybe_unused' attribute cannot be applied to types Log
libpwiz 3.0.18342-4pwiz/data/common/BinaryIndexStream.cpp:159:15: error: cannot assign to non-static data member within const member function 'operator[]' Log 758322
libratbag 0.15-1 Log
libreoffice 1:7.0.2-4/bin/sh: 1: git: not found Log
libs3 2.0-3inc/request.h:131:14: error: sizeof on pointer operation will return size of 'char *' instead of 'char [9]' [-Werror,-Wsizeof-array-decay] Log
libtemplates-parser 20-3 Log
libutempter 1.1.6-6utempter.c:167:32: error: unknown warning group '-Wstringop-truncation', ignored [-Werror,-Wunknown-warning-option] Log
libvcflib 1.0.1+dfsg-3 Log
libwebsockets 4.0.20-1 Log
libwx-perl 1:0.9932-5dh_auto_configure: error: perl -I. Makefile.PL INSTALLDIRS=vendor "OPTIMIZE=-g -O2 -fdebug-prefix-map=/<>=. -fstack-protector-strong -Wformat -Werror=format-security -Wdate-time -D_FORTIFY_SOURCE=2" "LD=x86_64-linux-gnu-gcc -g -O2 -fdebug-prefix-map=/<>=. -fstack-protector-strong -Wformat -Werror=format-security -Wl,-z,relro -Wl,-z,now" returned exit code 2 Log
lierolibre 0.5-3./src/gvl/io/encoding.hpp:586:19: error: cast from pointer to smaller type 'uint32_t' (aka 'unsigned int') loses information Log
lookup 1.08b-12lib/romaji2kana.c:59:12: error: source file is not valid UTF-8 Log
lordsawar 0.3.2+frogknows-1../../src/setlist.h:318:32: error: no class named 'const_iterator' in 'SetList' Log
lsp-plugins 1.1.26-1Undetected errorLog
mdm 0.1.3-2.1 Log
memtest86 4.3.7-3main.c:229:2: error: indirect goto in function with no address-of-label expressions Log
memtest86+ 5.01-3.1main.c:223:2: error: indirect goto in function with no address-of-label expressions Log
mia 2.4.7-1src.cxx:5:2: error: Altivec not supported Log
mira 4.9.6-5configure: error: Could not link against boost_thread ! Log
mona 1.4-17-2configure: error: C++ compiler not found Log
mozjs52 52.9.1-1.1configure: error: in `/tmp/icu-obj-CTtU0H' Log
mpich 3.4~a2+really3.3.2-2configure: error: Unable to configure with Fortran support because configure could not determine the size of a Fortran INTEGER. Consider setting CROSS_F77_SIZEOF_INTEGER to the length in bytes of a Fortran INTEGER Log
nanopb 0.4.3-1pb.h:285:5: error: '_Bool' is a C99 extension [-Werror,-Wc99-extensions] Log
newsboat 2.21-1/usr/bin/curl-config: 1: krb5-config: not found Log
nfstrace 0.4.3.2+git20200805+b220d04-1parser_thread.h:47:19: error: braces around scalar initializer [-Werror,-Wbraced-scalar-init] Log
odb 2.4.0-13../odb/relational/header.hxx:56:24: error: non-const lvalue reference to type 'semantics::data_member' cannot bind to a value of unrelated type 'relational::header::image_member_impl::member_info' (aka 'relational::member_base_impl::member_info') Log
odil 0.12.0-2Undetected errorLog
odin 2.0.4-0.2configure: error: Please install Blitz++ (Version 0.8 or higher) in order to use the reconstruction library (There is probably a precompiled package for your UNIX/Linux distribution, otherwise see http://blitz.sourceforge.net) Log
ogmrip 1.0.1-3ogmrip-encoding.c:1200:7: error: cast to union type from type 'int' not present in union Log
opa-ff 10.9.3.1.1-2clang: error: clang frontend command failed due to signal (use -v to see invocation) Log
open3d 0.9.0+ds-3Undetected errorLog
openhpi 3.8.0-2ipmi.cpp:1561:83: error: alias must point to a defined variable or function Log
openjade 1.4devel1-21.3configure: error: cannot compute sizeof (size_t) Log
openjdk-11-jre-dcevm 11.0.9+1-1configure: error: A gcc compiler is required. Try setting --with-tools-dir. Log
openmpi 4.0.5-7configure: error: Cannot continue Log
openvpn-auth-ldap 2.0.4-1configure: error: Can't locate Objective C runtime headers Log
pan 0.146-2text-match.cc:476:8: error: no viable conversion from 'pan::StringView' to 'std::__cxx11::basic_string' Log
pari 2.11.4-3Undetected errorLog
passwordsafe 1.11.0+dfsg-1PasswordSafeSearch.cpp:156:20: error: no viable conversion from 'SearchPointer' to 'std::vector >' Log
pcp 5.2.1-1access.o: r .L.str.1 : Error: additional symbol Log
pingus 0.7.6-5.1src/lisp/getters.hpp:33:15: error: no viable conversion from 'std::shared_ptr' to 'const lisp::Lisp *' Log
ppl 1:1.2-8.1./ppl.hh:66465:8: error: missing 'typename' prior to dependent type template name 'OR_Matrix::Pseudo_Row' Log
pplpy 0.8.4-4ppl.hh:66465:8: error: missing 'typename' prior to dependent type template name 'OR_Matrix::Pseudo_Row' Log
prime-phylo 1.0.11-9ODESolver.hh:359:20: error: in-class initializer for static data member of type 'const beep::Real' (aka 'const double') requires 'constexpr' specifier [-Wstatic-float-init] Log
primus 0~20150328-12./gl-passthru.def:2:1: error: ifunc must point to a defined function Log
projecteur 0.8-1new_allocator.h:156:4: error: destructor called on non-final 'KeySequenceAction' that has virtual functions but non-virtual destructor [-Werror,-Wdelete-non-abstract-non-virtual-dtor] Log
python3.8 3.8.6-1configure: error: in `/<>/build-static' Log
python3.9 3.9.0-5configure: error: in `/<>/build-static' Log
qemu 1:5.1+dfsg-4fdmon-io_uring.c:106:17: error: address argument to atomic operation must be a pointer to _Atomic type ('unsigned int *' invalid) Log
qgis 3.10.11+dfsg-1clang: error: clang frontend command failed due to signal (use -v to see invocation) Log
qiv 2.3.2-2Undetected errorLog
qtop 2.3.4-2File.h:327:18: error: qualified reference to 'File' is a constructor name rather than a type in this context Log
quickfix 1.15.1+dfsg-4Undetected errorLog
sachesi 2.0.4+ds-3src/installer_establish.cpp:22:13: error: static declaration of 'wolfSSL_RSA_get0_key' follows non-static declaration Log
safeclib 3.5-3test_mbsrtowcs_s.c:269:10: error: len overflow >dmax Log
scanbd 1.5.1-6Undetected errorLog
scipy 1.5.2-2Undetected errorLog
selint 1.1.0-1configure: error: in `/<>' Log
socat 1.7.3.4-1 Log
soundmodem 0.20-5../matlib/mat.hh:452:6: error: assigning to 'unsigned int *' from incompatible type 'void *' Log
starpu 1.3.7+dfsg-1 Log
stdsyslog 0.03.3-4stdsyslog.c:560:121: error: format specifies type 'void *' but the argument has type 'char *' [-Werror,-Wformat-pedantic] Log
stella 6.3-1 Log
subtitleeditor 0.54.0-4document.cc:81:40: error: addition of default argument on redeclaration makes this constructor a copy constructor Log
supercollider 1:3.10.4+repack-1 Log
suricata 1:5.0.3-1configure: error: unable to find any of needed to build ebpf files Log
tcptrack 1.4.2-2./IPAddress.h:19:58: error: all paths through this function will call itself [-Werror,-Winfinite-recursion] Log
transfermii 1:0.6.1-4wiimotefunctions.c:41:10: error: cannot compile this static initializer yet Log
troffcvt 1.04-24Undetected errorLog
tvc 5.0.3+git20151221.80e144e+dfsg-3Utils.cpp:318:16: error: variable-sized object may not be initialized Log
u-boot 2020.10+dfsg-1fast_spi.h:38:1: error: static_assert expression is not an integral constant expression Log
umbrello 4:20.08.1-1dh_auto_configure: error: cd obj-x86_64-linux-gnu && cmake -DCMAKE_INSTALL_PREFIX=/usr -DCMAKE_BUILD_TYPE=None -DCMAKE_INSTALL_SYSCONFDIR=/etc -DCMAKE_INSTALL_LOCALSTATEDIR=/var -DCMAKE_EXPORT_NO_PACKAGE_REGISTRY=ON -DCMAKE_FIND_PACKAGE_NO_PACKAGE_REGISTRY=ON -DCMAKE_INSTALL_RUNSTATEDIR=/run -DCMAKE_SKIP_INSTALL_ALL_DEPENDENCY=ON "-GUnix Makefiles" -DCMAKE_VERBOSE_MAKEFILE=ON -DCMAKE_INSTALL_LIBDIR=lib/x86_64-linux-gnu -DCMAKE_BUILD_TYPE=Debian -DCMAKE_INSTALL_SYSCONFDIR=/etc -DKDE_INSTALL_USE_QT_SYS_PATHS=ON -DBUILD_KF5=ON .. returned exit code 1 Log
upx-ucl 3.96-2./../src/lzma-sdk/C/7zip/Compress/LZMA/LZMAEncoder.cpp:971:9: error: misleading indentation; statement is not part of the previous 'if' [-Werror,-Wmisleading-indentation] Log
vdr-plugin-fritzbox 1.5.3-9 Log
veyon 4.4.2+repack1-1ObjectManager.h:58:25: error: calling 'toObject' with incomplete return type 'QJsonObject' Log
vnstat 2.6-2configure: error: in `/<>' Log
vsearch 2.15.0-1configure: error: in `/<>' Log
wsclean 2.10.1-1parallelfor.h:75:16: error: object of type 'aocommon::Barrier' cannot be assigned because its copy assignment operator is implicitly deleted Log
wsjtx 2.2.2+repack-2f95: error: unrecognized command-line option ‘-fopenmp=libomp’; did you mean ‘-fopenmp-simd’? Log
wvdial 1.61-5uniconfgen.h:323:19: error: no class named 'Iter' in 'UniConfGen' Log
wvstreams 4.6.1-15./include/wvscatterhash.h:186:46: error: invalid use of non-static data member 'xstatus' Log
xcftools 1.0.7-6Undetected errorLog
xfsprogs 5.6.0-1configure: error: LTO not supported by compiler. Log
xmlcopyeditor 1.2.1.3-4.1myipc.cpp:49:4: error: cannot initialize a member subobject of type 'WXWidget' (aka '_GtkWidget *') with an rvalue of type 'wxIntPtr' (aka 'long') Log
xmms2 0.8+dfsg-20Undetected errorLog
xmpi 2.2.3b8-14configure: error: cannot continue -- cannot find Log
yp-tools 3.3-5.3yp_order.c:42:26: error: cast from 'struct ypresp_order *' to 'ypresp_val *' (aka 'struct ypresp_val *') increases required alignment from 4 to 8 [-Werror,-Wcast-align] Log
yrmcds 1.1.9-1Undetected errorLog
z80ex 1.1.21-1dh_install: error: missing files, aborting Log
zegrapher 3.1.1-1 Log
zeitgeist 1.0.2-3controller.cpp:131:19: error: cannot cast from type 'gboolean (ZeitgeistFTS::Controller::*)()' to pointer type 'GSourceFunc' (aka 'int (*)(void *)') Log
zeroc-ice 3.7.4-1include/generated/Ice/LocalException.h:3853:40: error: dynamic exception specifications are deprecated [-Werror,-Wdeprecated-dynamic-exception-spec] Log
zookeeper 3.4.13-5 [javadoc] /<>/src/java/main/org/apache/zookeeper/server/NettyServerCnxnFactory.java:21: error: package org.jboss.netty.buffer does not exist Log
zynaddsubfx 3.0.5-2PluginTest.h:235: Error: Assertion failed: fdata == result Log
198 errors
Return to the list