Debian Package rebuild

Rebuild of the Debian archive with clang

"Not categorized" build failure(s)
clang 6.0
Return to the list

Versions: 2.9 - 3.0 - 3.1 - 3.2 - 3.3 - 3.4 - 3.4.2 - 3.5.0 - 3.6.0 - 3.8.1 - 3.9.1 - 4.0.1 - 5.0 - 6.0
PackageVersionSupposed error messageFull log Bug report
389-dsgw 1.1.11-2../edit.c:30:5: error: third parameter of 'main' (environment) must be of type 'char **' Log
3depict 0.0.19-1configure: error: "mgl2 specified, but header mgl2/mgl_cf.h not found" Log
9base 1:6-7n1.c:124:5: error: unterminated function-like macro invocation Log
ableton-link 3.0.1+dfsg-1AudioPlatform_Jack.cpp:33:18: error: zero as null pointer constant [-Werror,-Wzero-as-null-pointer-constant] Log
acbuild 0.4.0+dfsg-2Undetected errorLog
acl2 8.0dfsg-1Session terminated, terminating shell...E: ABORT: Received TERM signal (requesting cleanup and shutdown) Log
aconnectgui 0.9.0rc2-1-10configure: error: Sufficiently new version of libasound not found. Log 684508
acpid 1:2.0.28-1configure: error: "asprintf() not found" Log
aegisub 3.2.2+dfsg-3lpeg.c:2337:31: error: array has incomplete element type 'struct luaL_reg' Log
aeskulap 0.2.2b1+git20161206-4./poolinstance.h:46:25: error: no function named 'remove_instance' with type 'void (const Glib::RefPtr &)' was found in the specified scope Log
alljoyn-core-1509 15.09a+dfsg.1-2alljoyn_c/src/PermissionConfigurationListener.cc:33:17: error: using directive refers to implicitly-defined namespace 'std' [-Werror] Log
alljoyn-core-1604 16.04a+dfsg.1-2alljoyn_c/src/PermissionConfigurationListener.cc:32:17: error: using directive refers to implicitly-defined namespace 'std' [-Werror] Log
android-platform-libnativehelper 7.0.0+r33-1ld: final link failed: Bad value Log
ants 2.1.0-5Undetected errorLog
apbs 1.4-1Undetected errorLog
aplus-fsf 4.22.1-10configure: error: in `/<>' Log
apron 0.9.10-9ppl.hh:66465:8: error: missing 'typename' prior to dependent type template name 'OR_Matrix::Pseudo_Row' Log
aptitude 0.8.10-9../../../../src/generic/problemresolver/problemresolver.h:1724:17: error: use of non-static data member 'graph' of 'generic_problem_resolver' from nested type 'do_process_promotion' Log
arbtt 0.9.0.13-1Undetected errorLog
arj 3.10.22-17Undetected errorLog
arrayfire 3.3.2+dfsg1-4dh_auto_test: cd obj-x86_64-linux-gnu && make -j8 -Oline test "ARGS+=-R cpu -E 'large|dense|imageio'" ARGS\+=-j8 returned exit code 2 Log
aspell 0.60.7~20110707-4./common/errors.hpp:17:36: error: redeclaration of 'aerror_other' with a different type: 'const acommon::ErrorInfo *const' vs 'const struct AspellErrorInfo *const' Log
asterisk-espeak 4.0-1utils.h:1055:15: error: blocks support disabled - compile with -fblocks or pick a deployment target that supports them Log
asterisk-flite 3.0-1utils.h:1055:15: error: blocks support disabled - compile with -fblocks or pick a deployment target that supports them Log
asterisk-opus 13.7+20161113-4utils.h:1055:15: error: blocks support disabled - compile with -fblocks or pick a deployment target that supports them Log
attica 0.4.2-2listjob_inst.cpp:82:16: error: explicit instantiation of 'Attica::ListJob' must occur in namespace 'Attica' Log
aubio 0.4.5-1could not configure a C compiler! Log
autodocksuite 4.2.6-5configure: error: in `/<>/autodock' Log
avifile 1:0.7.48~20090503.ds-20common/avm_output.cpp:20:12: error: qualified reference to 'AvmOutput' is a constructor name rather than a type in this context Log
bagel 1.1.0-1configure: error: in `/<>' Log
ball 1.4.3~beta1-4dh_auto_test: cd build && make -j8 -Oline test ARGS\+=-j8 returned exit code 2 Log 755225
bart 0.4.03-1multind.h:19:14: error: blocks support disabled - compile with -fblocks or pick a deployment target that supports them Log
bcron 0.11-1.1Undetected errorLog
beast-mcmc 1.8.4+dfsg.1-2Undetected errorLog
belenios 1.4+dfsg-2Undetected errorLog
bind-dyndb-ldap 11.1-3../../src/mldap.c:122:3: error: used type 'typeof (((isc_refcount_t *)0)->refs)' (aka '_Atomic(int_fast32_t)') where arithmetic or pointer type is required Log
bing 1.3.5-2bing_misc.c:208:46: error: too many arguments provided to function-like macro invocation Log
binutils-mingw-w64 8.1dh_auto_test: cd build/i686-w64-mingw32 && make -j8 -Oline check returned exit code 2 Log
blcr 0.8.5-2.3Undetected errorLog
bmusb 0.7.2-1bmusb.cpp:635:16: error: 'target' attribute takes one argument Log
bomberclone 0.11.9-7mapmenu.c:353:70: error: implicit conversion from 'double' to 'int' changes value from 0.4 to 0 [-Werror,-Wliteral-conversion] Log
booth 1.0-7pacemaker.c:359:13: error: use of logical '||' with constant operand [-Werror,-Wconstant-logical-operand] Log
botch 0.21-5Undetected errorLog
bottleneck 1.2.0-6Undetected errorLog
brian 1.4.3-1ImportError: cannot import name weave Log
brise 0.35-1Undetected errorLog
busybox 1:1.27.2-2Undetected errorLog
captagent 6.1.0.20-3configure: error: captagent requires but cannot find libfl Log
carettah 0.4.2-5Undetected errorLog
cctz 2.2+dfsg1-1E: apt-cache returned no information about cctz source Log
cduce 0.6.0-5Undetected errorLog
ceph 10.2.5-7.2Undetected errorLog 749083
cernlib 20061220+dfsg3-4.3Undetected errorLog
cgal 4.12-1Undetected errorLog
chealpix 3.30.0-5configure: error: in `/<>' Log
cigi-ccl 3.3.3a+svn818-10dh_install: missing files, aborting Log
clblas 2.12-1dh_install: missing files, aborting Log
clfft 2.12.2-1dh_install: missing files, aborting Log
cln 1.3.4-3Undetected errorLog
cmocka 1.1.1-1dh_auto_test: cd obj-x86_64-linux-gnu && make -j8 -Oline test ARGS\+=-j8 returned exit code 2 Log
coinor-flopc++ 1.0.6-3.1./MP_set.hpp:208:14: error: no matching conversion for functional-style cast from 'const flopc::SUBSETREF' to 'flopc::MP_domain' Log
comedilib 0.10.2-4clang: error: clang frontend command failed with exit code 70 (use -v to see invocation) Log
consul 0.6.4~dfsg-4Undetected errorLog
cpl-plugin-visir 4.3.3+dfsg-1DEPS Log
cpluff 0.1.4+dfsg1-1cpluff.c:84:35: error: too many arguments provided to function-like macro invocation Log
cssc 1.4.0-5dh_auto_test: make -j8 -Oline check VERBOSE=1 returned exit code 2 Log
cura-engine 1:3.1.0-2StringTest.cpp:168:41: error: invalid suffix 'd' on floating constant Log
davix 0.6.7-3Undetected errorLog
dbuskit 0.1.1-3configure: error: "could not find runtime.h. DBusKit requires gnustep-base >=1.20." Log
dcmtk 3.6.2-3dh_auto_test: cd obj-x86_64-linux-gnu && make -j8 -Oline test ARGS\+=-j8 returned exit code 2 Log
debian-installer 20171204Undetected errorLog
dee 1.0.10-3.1/bin/bash: gtkdoc-mktmpl: command not found Log
dewalls 1.0.0+ds1-5Undetected errorLog
diagnostics 0.3.3-12marshaling.cpp:77:2: error: 'delete' applied to a pointer that was allocated with 'new[]'; did you mean 'delete[]'? [-Werror,-Wmismatched-new-delete] Log 751904
dicom3tools 1.00~20171209092658-1./Imakefile:177:3: error: invalid preprocessing directive Log
djview4 4.10.6-4configure: error: Cannot successfully run Qt program qmake. Log
dms 1.0.8.1-1Undetected errorLog
docker-swarm 1.2.5+dfsg-2Undetected errorLog
dogtag-pki 10.5.5-1} netscape/security/x509/RevocationReasonAdapter.java:20: error: package javax.xml.bind.annotation.adapters is not visible Log
doscan 0.3.3-1src/event_queue.cc:161:43: error: invalid operands to binary expression ('basic_ostream >' and 'std::ostream' (aka 'basic_ostream')) Log
dpdk 17.11.2-1error: unknown target CPU 'generic' Log
dspdfviewer 1.15.1-1hyperlinkarea.cpp:35:18: error: zero as null pointer constant [-Werror,-Wzero-as-null-pointer-constant] Log
duo-unix 1.9.21-1dpkg-shlibdeps: error: cannot continue due to the error above Log
dx 1:4.4.4-10edfio.c:329:14: error: static declaration of 'mkfifo' follows non-static declaration Log 743003
ebtables 2.0.10.4-4libebtc.c:45:21: error: use of GNU 'missing =' extension in designator [-Werror,-Wgnu-designator] Log
eclipse 3.8.1-11 [javac] /<>/build/eclipse-3.8.1-src/plugins/org.eclipse.osgi/osgi/src/org/osgi/framework/FrameworkUtil.java:120: error: unmappable character (0xC3) for encoding US-ASCII Log
eegdev 0.2-3.1dh_auto_test: make -j1 check VERBOSE=1 returned exit code 2 Log
efibootmgr 15-1make[3]: *** No rule to make target 'efivar.h', needed by 'efibootmgr.o'. Stop. Log 753644
ekg2 1:0.4~pre+20120506.1-14Makefile.am:144: error: 'plugins/autoresponder/autoresponder.la' is not a standard libtool library name Log
elfutils 0.170-0.4configure: error: gcc with GNU99 support required Log 758064
ergo 3.5-1configure: error: in `/<>' Log
esperanza 0.4.0+git20091017-5coll.h:615:6: error: binding value of type 'const Xmms::Coll::Coll' to reference to type 'Xmms::Coll::Coll' drops 'const' qualifier Log
esys-particle 2.3.5+dfsg1-2./SphAggGougeBlock.hpp:39:37: error: no viable conversion from '__normal_iterator, std::allocator > >::const_pointer, [...]>' to '__normal_iterator, std::allocator > >::pointer, [...]>' Log
etl 1.2.1-0.1fixed.cpp:133:55: error: no matching literal operator for call to 'operator""__FILE__' with arguments of types 'const char *' and 'unsigned long', and no matching literal operator template Log
f2j 0.8.1+dfsg-3clang: error: unable to execute command: Bus error Log
fakechroot 2.19-3dh_auto_test: make -j8 -Oline test VERBOSE=1 returned exit code 2 Log
faumachine 20160511-1./../arch_x86/arch_gen_cpu_x86_state.h:815:30: error: register 'rbx' unsuitable for global register variables on this target Log
faustworks 0.5~repack0-5Undetected errorLog
fbpanel 7.0-4Undetected errorLog
firebird3.0 3.0.3.32900.ds4-3libtool.m4: error: problem compiling CXX test program Log
fis-gtm 6.3-003A-2g_msf.si:21:12: error: unknown token in expression Log
flannel 0.9.1~ds1-1Undetected errorLog
fontforge 1:20170731~dfsg-1Undetected errorLog
forge 0.9.2-2dual_quaternion.hpp:24:3: error: "GLM: GLM_GTX_dual_quaternion is an experimental extension and may change in the future. Use #define GLM_ENABLE_EXPERIMENTAL before including it, if you really want to use it." Log
form 4.2.0+git20170914-1configure: error: in `/<>/form-4.2.0+git20170914' Log
fractalnow 0.8.2-1Undetected errorLog
frama-c 20170501+phosphorus+dfsg-2configure: error: in `/<>/frama-c-20170501+phosphorus+dfsg/src/plugins/e-acsl/contrib/libjemalloc' Log
freefem3d 1.0pre10-4libtool.m4: error: problem compiling CXX test program Log
freelan 2.0-6build/release/libs/cryptoplus/src/integer.cpp:69:25: error: instantiation of variable 'cryptoplus::pointer_wrapper::deleter' required here, but no definition is available [-Werror,-Wundefined-var-template] Log
frown 0.6.2.3-5Undetected errorLog
fuji 1.0.2-1Undetected errorLog
ga 5.4~beta~r10636+dfsg-5.1configure: error: f2c string convention is neither after args nor after string Log
gammaray 2.9.0-28: Error: Injector lldb failed to pass its self-test: The debugger executable 'lldb' could not be found. Log
ganeti 2.16.0~rc2-3configure: error: Unable to determine Sphinx version Log
gauche-c-wrapper 0.6.1-8Testing c-wrapper ... :444:1: error: pragma message requires parenthesized string Log
gb 0.4.4-2dh_auto_test: cd _build && go test -v -p 8 -short github.com/constabulary/gb github.com/constabulary/gb/cmd github.com/constabulary/gb/cmd/gb github.com/constabulary/gb/cmd/gb/internal/match github.com/constabulary/gb/cmd/gb-vendor github.com/constabulary/gb/internal/debug github.com/constabulary/gb/internal/depfile github.com/constabulary/gb/internal/fileutils github.com/constabulary/gb/internal/untar github.com/constabulary/gb/internal/vendor github.com/constabulary/gb/test returned exit code 1 Log
gbsplay 0.0.93-2Undetected errorLog
gcc-8-cross 11configure: error: C++ preprocessor "/lib/cpp" fails sanity check Log
gcc-mingw-w64 20.2configure: error: GNAT is required to build ada Log
geant321 1:3.21.14.dfsg-11Undetected errorLog
generator-scripting-language 4.1.5-3Undetected errorLog
getfem++ 5.2+dfsg1-6configure: error: g++ do not support option -std=c++11. Update g++ to at least release 4.8.1. Log
gforth 0.7.3+dfsg-5Undetected errorLog
git-annex 6.20180427-1Undetected errorLog
git-repair 1.20151215-1.1Undetected errorLog
gitlab-ci-multi-runner 10.5.0+dfsg-2dh_auto_test: cd _build && go test -vet=off -v -p 8 -ldflags "-X gitlab.com/gitlab-org/gitlab-runner/common.VERSION=10.5.0 -X gitlab.com/gitlab-org/gitlab-runner/common.REVISION=10.5.0" gitlab.com/gitlab-org/gitlab-runner gitlab.com/gitlab-org/gitlab-runner/apps/gitlab-runner-helper gitlab.com/gitlab-org/gitlab-runner/commands gitlab.com/gitlab-org/gitlab-runner/commands/helpers gitlab.com/gitlab-org/gitlab-runner/common gitlab.com/gitlab-org/gitlab-runner/executors gitlab.com/gitlab-org/gitlab-runner/executors/docker gitlab.com/gitlab-org/gitlab-runner/executors/docker/machine gitlab.com/gitlab-org/gitlab-runner/executors/kubernetes gitlab.com/gitlab-org/gitlab-runner/executors/parallels gitlab.com/gitlab-org/gitlab-runner/executors/shell gitlab.com/gitlab-org/gitlab-runner/executors/ssh gitlab.com/gitlab-org/gitlab-runner/executors/virtualbox gitlab.com/gitlab-org/gitlab-runner/helpers gitlab.com/gitlab-org/gitlab-runner/helpers/archives gitlab.com/gitlab-org/gitlab-runner/helpers/cli gitlab.com/gitlab-org/gitlab-runner/helpers/docker gitlab.com/gitlab-org/gitlab-runner/helpers/formatter gitlab.com/gitlab-org/gitlab-runner/helpers/gitlab_ci_yaml_parser gitlab.com/gitlab-org/gitlab-runner/helpers/parallels gitlab.com/gitlab-org/gitlab-runner/helpers/prometheus gitlab.com/gitlab-org/gitlab-runner/helpers/sentry gitlab.com/gitlab-org/gitlab-runner/helpers/service gitlab.com/gitlab-org/gitlab-runner/helpers/service/mocks gitlab.com/gitlab-org/gitlab-runner/helpers/ssh gitlab.com/gitlab-org/gitlab-runner/helpers/timeperiod gitlab.com/gitlab-org/gitlab-runner/helpers/tls gitlab.com/gitlab-org/gitlab-runner/helpers/url gitlab.com/gitlab-org/gitlab-runner/helpers/virtualbox gitlab.com/gitlab-org/gitlab-runner/network gitlab.com/gitlab-org/gitlab-runner/shells gitlab.com/gitlab-org/gitlab-runner/shells/mocks returned exit code 1 Log
gltron 0.70final-12.1configure: error: OpenGL is not installed Log
gluegen2 2.3.2-6 [javac] /<>/src/java/net/highteq/nativetaglet/NativeTaglet.java:3: error: package com.sun.tools.doclets does not exist Log
glusterfs 4.0.2-1clang: error: clang frontend command failed with exit code 70 (use -v to see invocation) Log
gnome-commander 1.4.8-1.1Undetected errorLog
gnome-vfs 1:2.24.4-6.1/bin/bash: gtkdoc-mktmpl: command not found Log
gnucap 1:0.36~20091207-2./mg_.h:134:19: error: variable has incomplete type 'C_Comment' Log
gnustep-base 1.25.1-2configure: error: Could not find Objective-C headers Log
golang 2:1.6-1Undetected errorLog
golang-1.6 1.6.3-1Undetected errorLog
golang-1.7 1.7.6-2Undetected errorLog
golang-1.8 1.8.5-1./test.bash: line 18: sysctl: command not found Log
golang-1.9 1.9.4-1./test.bash: line 18: sysctl: command not found Log
golang-github-appc-docker2aci 0.14.0+dfsg-2Undetected errorLog
golang-github-docker-libnetwork 0.8.0-dev.2+git20170202.599.45b4086-3Undetected errorLog
google-perftools 2.6.90-0.1Undetected errorLog
gpg-remailer 3.04.03-1mail/../cleartextmail/../mailer/send.f:11:17: error: cannot cast 'Mailer' to its private base class 'MailerBase' Log
gr-radar 0.0.0.20161018-3signal_generator_cw_c_impl.cc:83:20: error: implicit conversion from '_Complex double' to 'float' is not permitted in C++ Log
grafana 2.6.0+dfsg-3Undetected errorLog
grml2usb 0.16.0mbr.S:38:16: error: cannot use more than one symbol in memory operand Log
grub 0.97-72configure: error: GRUB requires GAS .code16 addr32 support; upgrade your binutils Log
grub2 2.02+dfsg1-4configure: error: could not force soft-float Log
gsequencer 1.4.25-1ags/lib/ags_function.c:527:3: error: illegal storage class on function Log
gtkdataboxmm 0.9.4-4Undetected errorLog
gummi 0.6.6-4gui/gui-preview.c:1044:5: error: must use 'struct' tag to refer to type 'synctex_scanner_t' Log
h2o 2.2.4+dfsg-1/bin/sh: 1: ruby: not found Log
haskell-blogliterately 0.8.6.1-1unsatisfiable build-dependency: libghc-pandoc-dev (< 2.2) but 2.2-1 is to be installed Log
haskell-derive 2.6.3-2unsatisfiable build-dependency: libghc-src-exts-dev (< 1.20) but 1.20.2-2 is to be installed Log
haskell-gitlib 3.1.1-5Undetected errorLog
haskell-gloss-rendering 1.11.1.1-2Undetected errorLog
haskell-graphviz 2999.19.0.0-1unsatisfiable build-dependency: libghc-fgl-dev (< 5.6) but 5.6.0.0-2 is to be installed Log
haskell-language-python 0.5.4-5Undetected errorLog
haskell-lens 4.16.1-1Undetected errorLog
haskell-protobuf 0.2.1.1-3Undetected errorLog
haskell-servant-server 0.13-1 Could not find module `Build_doctests' Log
haskell-thyme 0.3.5.5-2Undetected errorLog
haskell-trifecta 1.7.1.1-2 Could not find module `Build_doctests' Log
haskell-vector-th-unbox 0.2.1.6-4Undetected errorLog
haskell-wreq 0.5.2.1-1 Could not find module `Build_doctests' Log
healpix-cxx 3.30.0-8configure: error: in `/<>' Log
heartbeat 1:3.0.6-7E: apt-cache returned no information about heartbeat source Log
helpviewer.app 0.3-8clang: error: invalid value 'ISO-8859-1' in '-finput-charset=ISO-8859-1' Log
hepmc 2.06.09-1dh_auto_test: make -j1 check VERBOSE=1 returned exit code 2 Log
hhsuite 3.0~beta2+dfsg-3Undetected errorLog
hidrd 0.2.0-12num_test.c:133:21: error: format specifies type 'unsigned short' but the argument has type 'int' [-Werror,-Wformat] Log
hol-light 20170109-2Undetected errorLog
hothasktags 0.3.8-2unsatisfiable build-dependency: libghc-src-exts-dev (< 1.20) but 1.20.2-2 is to be installed Log
hugs98 98.200609.21-5.4tools/make_bootlib: 68: tools/make_bootlib: -D__HUGS__: not found Log
hylafax 3:6.0.6-8Undetected errorLog
i2p 0.9.34-1Undetected errorLog
i2pd 2.18.0-1Crypto.h:202:4: error: constructor cannot be redeclared Log
idjc 0.8.16-1configure: error: math library is missing critical function Log
ifrit 4.1.2-5Undetected errorLog
igraph 0.7.1-2.1dh_auto_test: make -j8 -Oline check VERBOSE=1 returned exit code 2 Log
imvirt 0.9.6-4vmware.c:65:5: error: invalid operand for instruction Log
influxdb 1.1.1+dfsg1-4dh_auto_test: cd _build && go test -vet=off -v -p 1 -timeout 12000s github.com/influxdata/influxdb github.com/influxdata/influxdb/client github.com/influxdata/influxdb/client/v2 github.com/influxdata/influxdb/cmd github.com/influxdata/influxdb/cmd/influx github.com/influxdata/influxdb/cmd/influx/cli github.com/influxdata/influxdb/cmd/influx_inspect github.com/influxdata/influxdb/cmd/influx_inspect/dumptsm github.com/influxdata/influxdb/cmd/influx_inspect/export github.com/influxdata/influxdb/cmd/influx_inspect/help github.com/influxdata/influxdb/cmd/influx_inspect/report github.com/influxdata/influxdb/cmd/influx_inspect/verify github.com/influxdata/influxdb/cmd/influx_stress github.com/influxdata/influxdb/cmd/influx_tsm github.com/influxdata/influxdb/cmd/influx_tsm/b1 github.com/influxdata/influxdb/cmd/influx_tsm/bz1 github.com/influxdata/influxdb/cmd/influx_tsm/stats github.com/influxdata/influxdb/cmd/influx_tsm/tsdb github.com/influxdata/influxdb/cmd/influx_tsm/tsdb/internal github.com/influxdata/influxdb/cmd/influxd github.com/influxdata/influxdb/cmd/influxd/backup github.com/influxdata/influxdb/cmd/influxd/help github.com/influxdata/influxdb/cmd/influxd/restore github.com/influxdata/influxdb/cmd/influxd/run github.com/influxdata/influxdb/coordinator github.com/influxdata/influxdb/importer/v8 github.com/influxdata/influxdb/influxql github.com/influxdata/influxdb/influxql/internal github.com/influxdata/influxdb/influxql/neldermead github.com/influxdata/influxdb/internal github.com/influxdata/influxdb/models github.com/influxdata/influxdb/monitor github.com/influxdata/influxdb/monitor/diagnostics github.com/influxdata/influxdb/pkg/deep github.com/influxdata/influxdb/pkg/escape github.com/influxdata/influxdb/pkg/limiter github.com/influxdata/influxdb/pkg/pool github.com/influxdata/influxdb/pkg/slices github.com/influxdata/influxdb/services/admin github.com/influxdata/influxdb/services/admin/statik github.com/influxdata/influxdb/services/collectd github.com/influxdata/influxdb/services/collectd/test_client github.com/influxdata/influxdb/services/continuous_querier github.com/influxdata/influxdb/services/graphite github.com/influxdata/influxdb/services/httpd github.com/influxdata/influxdb/services/meta github.com/influxdata/influxdb/services/meta/internal github.com/influxdata/influxdb/services/opentsdb github.com/influxdata/influxdb/services/precreator github.com/influxdata/influxdb/services/retention github.com/influxdata/influxdb/services/snapshotter github.com/influxdata/influxdb/services/subscriber github.com/influxdata/influxdb/services/udp github.com/influxdata/influxdb/stress github.com/influxdata/influxdb/stress/stress_test_server github.com/influxdata/influxdb/stress/v2 github.com/influxdata/influxdb/stress/v2/statement github.com/influxdata/influxdb/stress/v2/stress_client github.com/influxdata/influxdb/stress/v2/stressql github.com/influxdata/influxdb/stress/v2/stressql/statement github.com/influxdata/influxdb/tcp github.com/influxdata/influxdb/tests/urlgen github.com/influxdata/influxdb/toml github.com/influxdata/influxdb/tsdb github.com/influxdata/influxdb/tsdb/engine github.com/influxdata/influxdb/tsdb/engine/tsm1 github.com/influxdata/influxdb/tsdb/internal github.com/influxdata/influxdb/uuid returned exit code 1 Log
insighttoolkit4 4.12.2-dfsg1-1dh_auto_test: cd BUILD && make -j8 -Oline test ARGS\+=-j8 returned exit code 2 Log
jackd2 1.9.12~dfsg-2/bin/sh: 1: /usr/bin/licensecheck: not found Log 757820
java3d 1.5.2+dfsg-14Undetected errorLog
jblas 1.2.4-1Undetected errorLog
jffi 1.2.7-10Undetected errorLog
jhdf 2.11.0+dfsg-3configure: error: cannot find jdk classes in JDK lib path. Log
jinput 20100502+dfsg-9Undetected errorLog
jmagick 6.6.9~20130201-svn99-3configure: error: 'No Java header generator (javah) found' Log
js-of-ocaml 2.5-2make[3]: ocamlbuild: Command not found Log
jzmq 3.1.0-12configure: error: cannot find javah Log
kadu-mime-tex 2.1-1.2mime_tex_plugin.h:12: Error: Undefined interface Log
kdepim-runtime 4:17.12.3-1E: ABORT: Received TERM signal (requesting cleanup and shutdown) Log
keyutils 1.5.9-9.2dh_auto_test: make -j1 test PATH=/<>:/usr/local/sbin:/usr/local/bin:/usr/sbin:/usr/bin:/sbin:/bin:/usr/games LD_LIBRARY_PATH=/<> SKIPROOT=yes SKIPINSTALLED=yes returned exit code 2 Log
kicad 4.0.7+dfsg1-1Undetected errorLog
kimwitu++ 2.3.13-2dpkg-buildpackage: error: debian/rules build-arch subprocess returned exit status 2 Log
kubernetes-addon-heapster 1.2.0+dfsg-1Undetected errorLog
lam 7.1.4-3.1configure: error: *** Cannot continue. Log
lambda-align 1.0.3-3Undetected errorLog
launchtool 0.8-2Config.cc:36:16: error: explicit instantiation of 'std::map' must occur in namespace 'std' Log
lcgdm 1.10.0-2Undetected errorLog
ldc 1:1.8.0-2Undetected errorLog
libapache2-mod-perl2 2.0.10-2dh_auto_test: make -j1 test TEST_VERBOSE=1 returned exit code 2 Log
libautovivification-perl 0.18-1dh_auto_test: make -j1 test TEST_VERBOSE=1 returned exit code 2 Log
libbitcoin 2.11.0-1/bin/sh: 1: /usr/bin/licensecheck: not found Log
libbpp-phyl 2.4.0-1E: apt-cache returned no information about libbpp-phyl source Log
libclass-xsaccessor-perl 1.19-2dh_auto_test: make -j1 test TEST_VERBOSE=1 returned exit code 2 Log
libdata-uuid-perl 1.220-1Undetected errorLog
libdbi-drivers 0.9.0-6Undetected errorLog
libdevel-cover-perl 1.29-1dh_auto_test: make -j1 test TEST_VERBOSE=1 returned exit code 2 Log
libembperl-perl 2.5.0-11dh_auto_test: make -j1 test TEST_VERBOSE=1 returned exit code 2 Log
libfcgi-perl 0.78-2dh_auto_test: make -j1 test TEST_VERBOSE=1 returned exit code 2 Log
libfile-map-perl 0.65-1dh_auto_test: perl Build test --verbose 1 returned exit code 2 Log
libfiu 0.96-2dh_auto_test: make -j8 -Oline test V=1 LC_ALL=C returned exit code 2 Log
libfunction-parameters-perl 2.001003-1dh_auto_test: make -j1 test TEST_VERBOSE=1 returned exit code 2 Log
libgnome-keyring 3.12.0-1/bin/bash: gtkdoc-mktmpl: command not found Log
libgnomecanvas 2.30.3-3Undetected errorLog
libgpiv 0.6.1-7configure: error: "libgomp not installed" Log
libindirect-perl 0.38-1dh_auto_test: make -j1 test TEST_VERBOSE=1 returned exit code 2 Log
libiptcdata 1.0.4-6Undetected errorLog
libjna-java 4.5.1-1Undetected errorLog
libjogl2-java 2.3.2+dfsg-7Undetected errorLog 760294
libkf5kface 15.12.0-3Undetected errorLog
libkqueue 2.0.3-1.1src/linux/read.c:207:74: error: result of comparison of constant 0 with boolean expression is always false [-Werror,-Wtautological-constant-compare] Log 729591
liblemon 1.3.1+dfsg-1path.h:231:24: error: no viable conversion from 'typename PredMapPath >::RevArcIt' to 'std::vector >::value_type' (aka 'lemon::concepts::Digraph::Arc') Log
libmath-mpfr-perl 4.03-1have_d64.in:2:2: error: GNU decimal type extension not supported Log
libmatthew-java 0.8-2make[2]: /usr/lib/jvm/default-java/bin/javah: Command not found Log
libnative-platform-java 0.14-3make[2]: javah: Command not found Log
libncursesada 6.0.20170708-2configure: error: No usable Ada compiler found Log
libnet-ssleay-perl 1.85-1dh_auto_test: make -j8 -Oline test TEST_VERBOSE=1 returned exit code 2 Log
libnftnl 1.0.9-2E: apt-cache returned no information about libnftnl source Log 755956
libomxalsa 0.1-2configure: error: POSIX threads support is required Log
libomxcamera 0.1-2configure: error: in `/<>' Log
libomxfbdevsink 0.1-2configure: error: in `/<>' Log
libomxmad 0.1-1configure: error: POSIX threads support is required Log
libomxvideosrc 0.1-1configure: error: in `/<>' Log
libomxvorbis 0.1-3configure: error: in `/<>' Log
libomxxvideo 0.1-3configure: error: POSIX threads support is required Log
libphonenumber 7.1.0-5Undetected errorLog
libpreludedb 4.1.0-1E: apt-cache returned no information about libpreludedb source Log
libpulse-java 2.4.7-1Undetected errorLog
libqaccessibilityclient 0.1.1-5accessibleobject.h:718:38: error: no function named 'operator<<' with type 'QDebug (QDebug, const QAccessibleClient::AccessibleObject &)' was found in the specified scope Log
libreadline-java 0.8.0.1+dfsg-6make[5]: /usr/lib/jvm/default-java/bin/javah: Command not found Log 742220
libreswan 3.23-4ttorange.c:29:6: error: promoted type 'int' of K&R function parameter is not compatible with the parameter type 'bool' declared in a previous prototype [-Werror,-Wknr-promoted-parameter] Log
librevisa 0.0.20130812-2dh_auto_test: make -j8 -Oline check VERBOSE=1 returned exit code 2 Log
libs3 2.0-3inc/request.h:131:14: error: sizeof on pointer operation will return size of 'char *' instead of 'char [9]' [-Werror,-Wsizeof-array-decay] Log
libscope-upper-perl 0.30-1dh_auto_test: make -j1 test TEST_VERBOSE=1 returned exit code 2 Log
libset-object-perl 1.39-1dh_auto_test: make -j8 -Oline test TEST_VERBOSE=1 returned exit code 2 Log
libsis-base-java 14.12.0-5Undetected errorLog
libsis-jhdf5-java 14.12.6-1Undetected errorLog
libsocialweb 0.25.20-6configure: error: Package requirements (libnm-glib >= 0.7) were not met Log
libsyntax-keyword-try-perl 0.09-1dh_auto_test: perl Build test --verbose 1 returned exit code 255 Log
libtemplates-parser 17.2-3Undetected errorLog
libtritonus-java 20070428-13/<>/debian/javah: 8: exec: /usr/lib/jvm/default-java/bin/javah: not found Log
libvariable-magic-perl 0.62-1dh_auto_test: make -j1 test TEST_VERBOSE=1 returned exit code 2 Log
libwx-perl 1:0.9932-4Undetected errorLog
libwx-scintilla-perl 0.39-4Undetected errorLog
libzstd 1.3.4+dfsg-1dh_auto_test: make -j8 -Oline test returned exit code 2 Log
libzypp 16.4.3-1SolvIterMixin.h:169:60: error: invalid use of incomplete type 'zypp::asPoolItem' Log
lierolibre 0.5-3src/gvl/io/encoding.hpp:586:19: error: cast from pointer to smaller type 'uint32_t' (aka 'unsigned int') loses information Log
lilv 0.24.2~dfsg0-1could not configure a C compiler! Log
linbox 1.4.2-5configure: error: in `/<>' Log
llvm-toolchain-3.8 1:3.8.1-27sanitizer_stoptheworld_linux_libcdep.cc:275:22: error: variable has incomplete type 'struct sigaltstack' Log
lmms 1.1.3-7.1BiQuad.h:80:5: error: 'register' storage class specifier is deprecated and incompatible with C++17 [-Werror,-Wdeprecated-register] Log
lookup 1.08b-11lib/romaji2kana.c:59:12: error: source file is not valid UTF-8 Log
lua-inotify 0.4+git20151119-1Undetected errorLog
lua-systemd 0~git20160517-1Undetected errorLog
lv2 1.14.0~dfsg1-2dh_install: missing files, aborting Log
lwjgl 2.9.3+dfsg-1Undetected errorLog
mailfront 2.12-0.1builtins.c:9:24: error: static declaration of 'accept' follows non-static declaration Log
marisa 0.2.4-8dh_auto_test: make -j1 check VERBOSE=1 returned exit code 2 Log
mathgl 2.4.2.1-1datac.h:413:9: error: implicit conversion from 'mdual' (aka '_Complex double') to 'double' is not permitted in C++ Log
mclibs 20061220+dfsg3-3.1Undetected errorLog
mediawiki2latex 7.29-1Undetected errorLog
memtest86 4.3.7-3main.c:229:2: error: indirect goto in function with no address-of-label expressions Log
memtest86+ 5.01-3main.c:223:2: error: indirect goto in function with no address-of-label expressions Log
mira 4.9.6-3clang: error: argument to '-V' is missing (expected 1 value) Log
mixxx 2.0.0~dfsg-9qstringview.h:221:46: error: constexpr function never produces a constant expression [-Winvalid-constexpr] Log
mlucas 14.1-2configure: error: in `/<>' Log
mona 1.4-17-1configure: error: C++ compiler not found Log
mongodb 1:3.4.14-3Undetected errorLog
monkeysphere 0.41-1dh_auto_test: make -j8 -Oline test returned exit code 2 Log
moonshot-ui 0.7.2-1src/moonshot-identity-management-view.vala:357.40-357.43: error: Argument 1: Cannot pass value to reference or output parameter Log
mozjs52 52.3.1-7configure: error: in `/tmp/icu-obj-eW2tpy' Log
mp3check 0.8.7-2tstring.cc:114:13: error: 'new' expression with placement arguments refers to non-placement 'operator delete' Log
mpich 3.3~b2-5configure: error: Unable to configure with Fortran support because configure could not determine the size of a Fortran INTEGER. Consider setting CROSS_F77_SIZEOF_INTEGER to the length in bytes of a Fortran INTEGER Log
mrpt 1:1.5.5-1stdlib.h:90:3: error: "Assumed value of MB_LEN_MAX wrong" Log
mrs 6.0.5+dfsg-5Undetected errorLog
mtbl 0.8.0-1configure: error: Package requirements (liblz4 > 129) were not met Log
mumble 1.2.19-1Murmur.ice:9: error: Can't open include file "Ice/SliceChecksumDict.ice" Log 753273
myodbc 5.1.10-3stringutil.c:71:53: error: too few arguments to function call, expected 3, have 2 Log
nbibtex 0.9.18-11Undetected errorLog
nexus 4.3.2-svn1921-6checking if /usr/lib/jvm/default-java/bin/javac works... configure: error: The Java compiler /usr/lib/jvm/default-java/bin/javac failed (see config.log, check the CLASSPATH?) Log
nghttp2 1.31.1-1dh_auto_test: make -j8 -Oline check VERBOSE=1 returned exit code 2 Log
nitroshare 0.3.3-1Undetected errorLog
nn 6.7.3-10make[2]: *** No rule to make target ' articles.h', needed by 'nn.o'. Stop. Log
nomad 0.4.0+dfsg-1Undetected errorLog
norm 1.5r6+dfsg1-7Undetected errorLog
normaliz 3.5.1+ds-4configure: error: openmp not available Log
notary 0.1~ds1-1Undetected errorLog
npapi-vlc 2.0.6-4control/nporuntime.h:225:13: error: static declaration of 'RuntimeNPClassGetProperty' follows non-static declaration Log
ns3 3.27+dfsg-1could not configure a C compiler! Log
ntpsec 1.1.0+dfsg1-1could not configure a C compiler! Log
nullmailer 1:2.1-7sendmail.cc:114:26: error: variable-sized object may not be initialized Log
nuxwdog 1.0.3-4Caused by: java.io.IOException: error=2, No such file or directory Log
nwchem 6.8+47+gitdf6c956-1configure: error: in `/<>/nwchem-6.8+47+gitdf6c956/src/tools/build' Log
oath-toolkit 2.6.1-1/bin/bash: gtkdoc-mktmpl: command not found Log
objcryst-fox 1.9.6.0-2.1RefinableObj.cpp:2015:16: error: explicit instantiation of 'ObjCryst::ObjRegistry' must occur in namespace 'ObjCryst' Log
ocaml 4.05.0-10/bin/sh: 1: clang: not found Log
ocaml-migrate-parsetree 1.0.7-1Undetected errorLog
ocaml-rope 0.6-1Undetected errorLog
octave-linear-algebra 2.2.2-4configure: error: Could not run /usr/bin/mkoctfile --verbose Log
odb 2.4.0-6../odb/relational/header.hxx:56:24: error: non-const lvalue reference to type 'semantics::data_member' cannot bind to a value of unrelated type 'relational::header::image_member_impl::member_info' (aka 'relational::member_base_impl::member_info') Log
ogmrip 1.0.1-1ogmrip-encoding.c:1200:7: error: cast to union type from type 'int' not present in union Log
opari2 2.0.2-4dh_install: missing files, aborting Log
open-cobol 1.1-2dh_auto_test: make -j1 check VERBOSE=1 returned exit code 2 Log
openafs 1.8.0-1dh_auto_test: make -j1 test VERBOSE=1 returned exit code 2 Log
openalpr 2.3.0-1Undetected errorLog
opencolorio 1.1.0~dfsg0-1unicodeobject.h:534:5: error: 'register' storage class specifier is deprecated and incompatible with C++17 [-Werror,-Wdeprecated-register] Log
openfoam 4.1+dfsg1-2lnInclude/CrankNicolsonDdtScheme.C:104:1: error: missing 'typename' prior to dependent type template name 'CrankNicolsonDdtScheme::DDt0Field' Log
opengm 2.3.6+20160905-1Undetected errorLog
opengrm-ngram 1.3.2-3Undetected errorLog
openhpi 3.6.1-3.1ipmi.cpp:1561:83: error: alias must point to a defined variable or function Log
openjade 1.4devel1-21.3configure: error: cannot compute sizeof (size_t) Log
openjpeg2 2.3.0-1Undetected errorLog
openmama 2.2.2.1-11.1Caused by: java.io.IOException: error=2, No such file or directory Log
openmpi 3.0.1.real-1configure: error: cannot continue Log
openmsx-catapult 0.14.0-1Undetected errorLog
openvpn-auth-ldap 2.0.3-6.1configure: error: Can't locate Objective C runtime headers Log
os-autoinst 4.4.1508936943.39adc5eb-2dh_auto_test: make -j8 -Oline check VERBOSE=1 returned exit code 2 Log
ossim 2.3.1-1E: apt-cache returned no information about ossim source Log
ovito 2.9.0+dfsg1-5Undetected errorLog
packer 1.0.4+dfsg-1Undetected errorLog
paexec 1.0.1-4dh_auto_test: mkcmake PREFIX=/usr MANDIR=/usr/share/man INFODIR=/usr/share/info SYSCONFDIR=/etc LIBDIR=/usr/lib/x86_64-linux-gnu LIBEXECDIR=/usr/lib/x86_64-linux-gnu test returned exit code 1 Log
paw 1:2.14.04.dfsg.2-9.1Undetected errorLog
pcl 1.8.1+dfsg1-2selectionTransformTool.cpp:198:15: error: cannot take the address of an rvalue of type 'float' Log
pcp 4.0.1-1access.o: r .L.str.1 : Error: additional symbol Log
pgloader 3.4.1+dfsg-1Undetected errorLog
php7cc 1.1.0-1Undetected errorLog
picviz 0.5-1Undetected errorLog
pike8.0 8.0.498-1ld: final link failed: Bad value Log
pingus 0.7.6-4src/lisp/getters.hpp:33:15: error: no viable conversion from 'std::shared_ptr' to 'const lisp::Lisp *' Log
pkg-haskell-tools 0.11.1unsatisfiable build-dependency: libghc-shake-dev (< 0.16) but 0.16.4-2 is to be installed Log
planner 0.14.6-5/bin/bash: gtkdoc-mktmpl: command not found Log
plplot 5.13.0+dfsg-7dh_install: missing files, aborting Log
polymake 3.2r2-3Undetected errorLog
portabase 2.1+git20120910-1.1Undetected errorLog
postgresql-10 10.3-2Undetected errorLog
ppl 1:1.2-2./OR_Matrix_inlines.hh:100:8: error: missing 'typename' prior to dependent type template name 'OR_Matrix::Pseudo_Row' Log
ppx-core 113.33.03-1Undetected errorLog
prime-phylo 1.0.11-4PrimeOptionMap.hh:161:32: error: no function named 'operator<<' with type 'std::ostream &(std::ostream &, const beep::PrimeOptionMap &)' (aka 'basic_ostream &(basic_ostream &, const beep::PrimeOptionMap &)') was found in the specified scope Log
primus 0~20150328-6./gl-passthru.def:2:1: error: ifunc must point to a defined function Log
proftpd-mod-counter 0.6.1-1E: apt-cache returned no information about proftpd-mod-counter source Log
proj 5.0.1-1Undetected errorLog
prometheus-alertmanager 0.6.2+ds-5Undetected errorLog
promoe 0.1.1-3coll.h:615:6: error: binding value of type 'const Xmms::Coll::Coll' to reference to type 'Xmms::Coll::Coll' drops 'const' qualifier Log
psi 1.3-4Undetected errorLog
pylucene 4.10.1+dfsg-2Undetected errorLog
pymc 2.2+ds-1.1OSError: [Errno 2] No such file or directory: 'blas/BLAS' Log
pymol 2.1.0+dfsg-1contrib/champ/champ.c:2787:3: error: unterminated function-like macro invocation Log
pymvpa2 2.6.4-2Undetected errorLog
python-afl 0.6.1-3E: apt-cache returned no information about python-afl source Log
python-cartopy 0.14.2+dfsg1-2dh_auto_test: pybuild --test -i python{version} -p 2.7 returned exit code 13 Log
python-cryptography 2.1.4-1Undetected errorLog
python-enable 4.5.1-4Undetected errorLog
python-escript 5.1-6Undetected errorLog
python-gevent 1.2.2-2ImportError: No module named gevent Log
python-memprof 0.3.4-1dh_auto_test: pybuild --test -i python{version} -p 3.6 returned exit code 13 Log
python-pygit2 0.26.3-1dh_auto_test: pybuild --test -i python{version} -p 3.6 returned exit code 13 Log
python-pytc 0.8-2/bin/sh: 3: pythonpython2.7-dbg: not found Log
python-ratelimiter 1.2.0-1Undetected errorLog
python-scipy 0.19.1-2Undetected errorLog
python-traits 4.6.0-1dh_auto_test: pybuild --test -i python{version} -p 2.7 returned exit code 13 Log
pytone 3.0.0-1.1dh_clean: Compatibility levels before 5 are no longer supported (level 4 requested) Log
pyviennacl 1.0.2+dfsg-1src/_viennacl/vector_float.cpp:5:3: error: address of overloaded function 'project' does not match required type 'viennacl::vector_range > (viennacl::vector_base &, const viennacl::basic_range &)' Log
qbrew 0.4.1-8Undetected errorLog
qca2 2.1.3-2sh: 1: error: Problems running dot: exit code=127, command='dot', arguments='"/<>/build-qt5/apidocs/html/classQCA_1_1PGPKeyContext__coll__graph.dot" -Tpng -o "/<>/build-qt5/apidocs/html/classQCA_1_1PGPKeyContext__coll__graph.png"' Log
qtile 0.10.7-2dh_auto_test: pybuild --test --test-pytest -i python{version} -p 3.6 returned exit code 13 Log
qtop 2.3.4-1File.h:327:18: error: qualified reference to 'File' is a constructor name rather than a type in this context Log
quickfix 1.14.4+dfsg-1Undetected errorLog
quixote 2.7~b2-1.1dpkg-buildpackage: error: debian/rules build-arch subprocess returned exit status 2 Log
raincat 1.1.1.2-3 Could not find module `Item.Items' Log
refind 0.11.2-1Undetected errorLog
regina-normal 5.1-5sequence.h:563:8: error: missing 'typename' prior to dependent type template name 'LightweightSequence::SubsequenceCompareFirstPtr' Log
remctl 3.14-1dh_auto_test: make -j8 -Oline check VERBOSE=1 returned exit code 2 Log
reposurgeon 3.42-2dh_auto_test: make -j8 -Oline check returned exit code 2 Log
reprepro 5.1.1-1sourceextraction.c:135:2: error: illegal storage class on function Log
resiprocate 1:1.11.0~beta5-1TextChannel.cxx:113:57: error: 'this' argument to member function 'getCreatedTimeMicroSec' has type 'const resip::SipMessage', but function is not marked const Log
rivet 1.8.3-2configure: error: Can't build Python extension since /usr/bin/swig is not compatible with /usr/bin/g++. Get a newer SWIG version! Log
rkt 1.29.0+dfsg-1Undetected errorLog
rsrce 0.2.2dh_clean: Compatibility levels before 5 are no longer supported (level 4 requested) Log
ruby-augeas 1:0.5.0-3extconf.rb:27:in `
': augeas-devel not installed (RuntimeError)
Log
ruby-cairo 1.15.12-1ERROR: Test "ruby2.5" failed: Error: test: time(PDFSurfaceTest::#set_metadata::modified date): Poppler::Error::Invalid: Failed to load document Log
ruby-dep-selector 1.0.3-2./dep_selector_to_gecode.h:162:7: error: use of class template 'DFS' requires template arguments Log
ruby-eventmachine 1.0.7-4E: ABORT: Received TERM signal (requesting cleanup and shutdown) Log
ruby-libvirt 0.7.0-1extconf.rb:73:in `
': libvirt library not found in default locations (RuntimeError)
Log
sagemath 8.1-7Undetected errorLog
scalapack 2.0.2-7Undetected errorLog 710395
scheme48 1.9-5Undetected errorLog
scilab 6.0.1-1configure: error: Cannot find javah Log
scram 0.16.2-1variant:238:46: error: cannot cast 'const std::variant' to its private base class 'std::__detail::__variant::_Variant_storage' Log
scute 1.5.0+git20160808+94eeb2d-2dh_auto_test: make -j1 check VERBOSE=1 returned exit code 2 Log
serd 0.28.0~dfsg0-1could not configure a C compiler! Log
sfepy 2016.2-4Undetected errorLog
sheepdog 0.8.3-5:1:9: error: unknown token in expression in '.set' directive Log
showq 0.4.1+git20161215~dfsg0-3Undetected errorLog
sigx 2.0.2-5./sigx/static_assert.h:34:1: error: declaration of anonymous struct must be a definition Log
sikulix 1.1.1-8Undetected errorLog
sks-ecc 0.93-6tfm/mpi.c:2565:15: error: unknown register name '%cc' in asm Log
sniffles 1.0.8+ds-1Undetected errorLog
sofa-framework 1.0~beta4-12../../../modules/sofa/component/topology/QuadSetGeometryAlgorithms.h:113:14: error: inline declaration of 'areaProduct' follows non-inline definition Log
sord 0.16.0~dfsg0-1could not configure a C compiler! Log
soundmodem 0.20-5../matlib/mat.hh:452:6: error: assigning to 'unsigned int *' from incompatible type 'void *' Log
sparse 0.5.2-1+/usr/include/stdio.h:27:11: error: unable to open 'bits/libc-header-start.h' Log
speech-dispatcher 0.8.8-1Undetected errorLog
speedcrunch 0.12.0-3Undetected errorLog
sphde 1.3.0-1./sasatom_x86_64.h:90:56: error: unsupported inline asm: input with type 'long' matching output with type 'char' Log
sratom 0.6.0~dfsg0-1could not configure a C compiler! Log
srg 1.3.6-2output.cc:101:22: error: cannot initialize an array element of type 'char *' with an rvalue of type 'char' Log
stdsyslog 0.03.3-1stdsyslog.c:560:121: error: format specifies type 'void *' but the argument has type 'char *' [-Werror,-Wformat-pedantic] Log
strongswan 5.6.2-2E: ABORT: Received TERM signal (requesting cleanup and shutdown) Log
stunnel4 3:5.44-1dh_auto_test: make -j8 -Oline test VERBOSE=1 returned exit code 2 Log
stx-btree 0.9-2WTreeDrawing.cpp:77:30: error: typedef 'btree_impl' cannot be referenced with a class specifier Log
styx 2.0.1-1sysbase1.c:579:50: error: invalid token at start of a preprocessor expression Log
subtle 0.11.3224-xi-2.2Undetected errorLog
suil 0.10.0~dfsg0-1could not configure a C compiler! Log
sundials 2.7.0+dfsg-2dh_install: missing files, aborting Log 812157
sunpy 0.8.3-1Undetected errorLog
sushi 1.4.0+git20160822+dfsg-4could not configure a C compiler! Log
swarmkit 1.12.0+git20170201.779.1c7f003d-3make[2]: git: Command not found Log
swift-im 3.0.4-1Undetected errorLog
synfig 1.0.2-1_handle.h:346:11: error: no matching conversion for functional-style cast from 'etl::handle::value_type *const' (aka 'synfig::Layer *const') to 'handle' Log
systemd-docker 0.2.1+dfsg-2Undetected errorLog
t50 5.7.1-1randomizer.c:83:7: error: unknown use of instruction mnemonic without a size suffix Log
tarantool 1.7.5.46.gd98815384-1Undetected errorLog
tcptrack 1.4.2-2./IPAddress.h:19:58: error: all paths through this function will call itself [-Werror,-Winfinite-recursion] Log
tendermint 0.8.0+git20170113.0.764091d-2dh_auto_test: cd obj-x86_64-linux-gnu && go test -vet=off -v -p 1 github.com/tendermint/tendermint/benchmarks github.com/tendermint/tendermint/benchmarks/proto github.com/tendermint/tendermint/benchmarks/simu github.com/tendermint/tendermint/blockchain github.com/tendermint/tendermint/cmd/tendermint github.com/tendermint/tendermint/config/tendermint github.com/tendermint/tendermint/config/tendermint_test github.com/tendermint/tendermint/consensus github.com/tendermint/tendermint/fail-test github.com/tendermint/tendermint/mempool github.com/tendermint/tendermint/node github.com/tendermint/tendermint/proxy github.com/tendermint/tendermint/rpc/core github.com/tendermint/tendermint/rpc/core/types github.com/tendermint/tendermint/rpc/grpc github.com/tendermint/tendermint/rpc/test github.com/tendermint/tendermint/state github.com/tendermint/tendermint/test/app github.com/tendermint/tendermint/types github.com/tendermint/tendermint/version returned exit code 1 Log
thin-provisioning-tools 0.7.4-2Undetected errorLog
thumbor 6.3.2-4E: ABORT: Received TERM signal (requesting cleanup and shutdown) Log
tiemu 3.04~git20110801-nogdb+dfsg-1stdlib.h:588:20: error: too many arguments provided to function-like macro invocation Log
tikzit 1.0+ds-2configure: error: Objective C Foundation not found -- missing gnustep-base(-devel)? Log
tiledarray 0.6.0-5Undetected errorLog
tomboy 1.14.1-4make[4]: *** No rule to make target '.config.in', needed by '../bin/Tomboy.exe.config'. Stop. Log
torus-trooper 0.22.dfsg1-11src/abagames/util/rand.d:8:16: error: module stream is in file 'std/stream.d' which cannot be read Log
toulbar2 0.9.8-1tb2wcsp.cpp:873:14: error: invalid operands to binary expression ('std::istream' (aka 'basic_istream') and 'long') Log
tpb 0.6.4-11Undetected errorLog
transfermii 1:0.6.1-3wiimotefunctions.c:41:10: error: cannot compile this static initializer yet Log
troffcvt 1.04-24Undetected errorLog
tudu 0.10.2-1./configure: 394: ./configure: rmtest.c: not found Log
tumiki-fighters 0.2.dfsg1-8src/abagames/util/rand.d:8:16: error: module stream is in file 'std/stream.d' which cannot be read Log
tupi 0.2+git08-1Undetected errorLog
turnserver 0.7.3-6turnserver.c:959:57: error: size argument in 'memcmp' call is a comparison [-Werror,-Wmemsize-comparison] Log
udisks2 2.7.6-3dh_auto_test: make -j8 -Oline check VERBOSE=1 returned exit code 2 Log
uhub 0.4.1-3.1ld: final link failed: Bad value Log
ui-gxmlcpp 1.4.4-2Undetected errorLog
ui-utilcpp 1.8.5-2Undetected errorLog
urweb 20170720+dfsg-2configure: error: in `/<>/urweb-20170720+dfsg' Log
val-and-rick 0.1a.dfsg1-5src/abagames/util/rand.d:8:16: error: module stream is in file 'std/stream.d' which cannot be read Log
varnish-modules 0.12.1-1Undetected errorLog
vboot-utils 0~R63-10032.B-3Undetected errorLog
vdr-plugin-softhddevice 0.6.0+git20160108-3make[1]: *** No rule to make target 'alsa/iatomic.h', needed by 'softhddev.o'. Stop. Log
visualvm 1.3.9-1 [javac] /<>/netbeans/nbbuild/antsrc/org/netbeans/nbbuild/ModuleSelector.java:72: error: ModuleSelector is not abstract and does not override abstract method isSelected(Resource) in ResourceSelector Log
vowpal-wabbit 8.5.0.dfsg1-2DEPS Log
voxbo 1.8.5~svn1246-2vbjobspec.cpp:546:28: error: no viable conversion from 'VBpri' to 'std::__cxx11::basic_string' Log
vtgrab 0.1.8-3dh_clean: Please specify the compatibility level in debian/compat Log
vulkan 1.1.70+dfsg1-1Undetected errorLog
wayland 1.14.0-2E: apt-cache returned no information about wayland source Log
websocketpp 0.7.0-12clang: error: no input files Log
wesnoth-1.12 1:1.12.6-1Undetected errorLog
wmaker 0.95.8-2Undetected errorLog
wsjt 9.7.r3639+dfsg-1.1error: unknown file type '' (from '-Wdate-time') Log
wvdial 1.61-4.1uniconfgen.h:323:19: error: no class named 'Iter' in 'UniConfGen' Log
wvstreams 4.6.1-11./include/wvscatterhash.h:186:46: error: invalid use of non-static data member 'xstatus' Log
xbase64 3.1.2-12Undetected errorLog
xcftools 1.0.7-6Undetected errorLog
xenomai 2.6.4+dfsg-1clocktest.c:40:23: error: typedef redefinition with different types ('unsigned long' vs 'struct cpu_set_t') Log
xf86-video-glamo 0.0.0+20110719.gitcb9ed170-2../../src/glamo-draw.c:280:33: error: incompatible pointer types passing 'void (pointer, OSTimePtr, pointer)' (aka 'void (void *, struct timeval **, void *)') to parameter of type 'ServerBlockHandlerProcPtr' (aka 'void (*)(void *, void *)') [-Werror,-Wincompatible-pointer-types] Log
xmlcopyeditor 1.2.1.3-1myipc.cpp:49:4: error: cannot initialize a member subobject of type 'WXWidget' (aka '_GtkWidget *') with an rvalue of type 'wxIntPtr' (aka 'long') Log
xmms2 0.8+dfsg-18.1coll.h:615:6: error: binding value of type 'const Xmms::Coll::Coll' to reference to type 'Xmms::Coll::Coll' drops 'const' qualifier Log
xmpi 2.2.3b8-13.2configure: error: cannot continue -- cannot find Log
xpyb 1.3.1-1.1Undetected errorLog
yabause 0.9.14-2.1dh_install: missing files, aborting Log
yapet 1.0-9eventqueue.cc:635:60: error: no viable conversion from 'YACURS::EventConnectorBase' to 'std::map >, std::less, std::allocator > > > >::key_type' (aka 'YACURS::EventType') Log
ycmd 0+20161219+git486b809-2.1Undetected errorLog
yodl 4.02.00-2process/processall.cc:29:15: error: fallthrough attribute is only allowed on empty statements Log
yosys 0.7-2Undetected errorLog
yp-tools 3.3-5.1yp_order.c:42:26: error: cast from 'struct ypresp_order *' to 'ypresp_val *' (aka 'struct ypresp_val *') increases required alignment from 4 to 8 [-Werror,-Wcast-align] Log
yrmcds 1.1.8-1.1Undetected errorLog
z80ex 1.1.21-1dh_install: missing files, aborting Log
zabbix 1:3.0.12+dfsg-1configure: error: PostgreSQL version mismatch Log
zope2.13 2.13.22-1ImportError: cannot import name requests Log
zypper 1.12.4-1SolvIterMixin.h:169:60: error: invalid use of incomplete type 'zypp::asPoolItem' Log
492 errors
Return to the list