Debian Package rebuild

Rebuild of the Debian archive with clang

"Not categorized" build failure(s)
clang 9.0.1
Return to the list

Versions: 2.9 - 3.0 - 3.1 - 3.2 - 3.3 - 3.4 - 3.4.2 - 3.5.0 - 3.6.0 - 3.8.1 - 3.9.1 - 4.0.1 - 5.0 - 6.0 - 8.0.1 - 9.0.1 - 10
PackageVersionSupposed error messageFull log Bug report
0ad 0.0.23.1-4../../build/unix/gold/ld: error: hidden symbol 'ceil' is not defined locally Log
3dchess 0.8.1-20Undetected errorLog
aconnectgui 0.9.0rc2-1-10configure: error: Sufficiently new version of libasound not found. Log 684508
acpid 1:2.0.32-1configure: error: "asprintf() not found" Log
android-platform-libnativehelper 8.1.0+r23-1ld: final link failed: bad value Log
apbs 1.4-1dh_auto_configure: error: cd obj-x86_64-linux-gnu && cmake -DCMAKE_INSTALL_PREFIX=/usr -DCMAKE_BUILD_TYPE=None -DCMAKE_INSTALL_SYSCONFDIR=/etc -DCMAKE_INSTALL_LOCALSTATEDIR=/var -DCMAKE_EXPORT_NO_PACKAGE_REGISTRY=ON -DCMAKE_FIND_PACKAGE_NO_PACKAGE_REGISTRY=ON "-GUnix Makefiles" -DCMAKE_VERBOSE_MAKEFILE=ON -DCMAKE_INSTALL_LIBDIR=lib/x86_64-linux-gnu -DCMAKE_BUILD_TYPE=None -DCMAKE_SKIP_RPATH=On -DBUILD_DOC=Off -DBUILD_TOOLS=Off -DENABLE_OPENMP=On -DENABLE_MPI=On -DENABLE_ZLIB=On -DENABLE_PYTHON=On -DENABLE_READLINE=Off -DFETK_PATH=/usr -DENABLE_FETK=Off .. returned exit code 1 Log
apron 0.9.10-9.1ppl.hh:66465:8: error: missing 'typename' prior to dependent type template name 'OR_Matrix::Pseudo_Row' Log
aptitude 0.8.12-1../../../../src/generic/problemresolver/problemresolver.h:1725:17: error: use of non-static data member 'graph' of 'generic_problem_resolver' from nested type 'do_process_promotion' Log
arj 3.10.22-23Undetected errorLog
auto-07p 0.9.2+dfsg-2configure: error: COIN3D is not installed Log
autodocksuite 4.2.6-7configure: error: in `/<>/autodock' Log
avifile 1:0.7.48~20090503.ds-20.1common/avm_output.cpp:20:12: error: qualified reference to 'AvmOutput' is a constructor name rather than a type in this context Log
belr 0.1.3-2new_allocator.h:153:4: error: destructor called on non-final 'belr::ParserHandler, std::shared_ptr >' that has virtual functions but non-virtual destructor [-Werror,-Wdelete-non-abstract-non-virtual-dtor] Log
bind-dyndb-ldap 11.2-1../../src/mldap.c:122:3: error: used type 'typeof (((isc_refcount_t *)0)->refs)' (aka '_Atomic(int_fast32_t)') where arithmetic or pointer type is required Log
binutils 2.34-3Undetected errorLog
binutils-djgpp 1.3Undetected errorLog
binutils-mipsen 5+c5Undetected errorLog
binutils-riscv64-unknown-elf 2.32.2019.08+dfsg-1Undetected errorLog
binutils-z80 4Undetected errorLog
bmusb 0.7.4-4bmusb.cpp:641:16: error: 'target' attribute takes one argument Log
busybox 1:1.30.1-4Undetected errorLog
calcoo 1.3.18-7E: apt-cache returned no information about calcoo source Log
cargo 0.40.0-3Undetected errorLog
cataclysm-dda 0.D-4src/clzones.h:245:23: error: explicitly defaulted move assignment operator is implicitly deleted [-Werror,-Wdefaulted-function-deleted] Log
cernlib 20061220+dfsg3-4.4Undetected errorLog
cgal 5.0.1-1Undetected errorLog
clfft 2.12.2-1dh_install: error: missing files, aborting Log
cog 0.4.0-2cog-launcher.c:529:9: error: cannot jump from this goto statement to its label Log
collectd 5.9.2.g-1configure: error: strtok_r is not available. Please file a bugreport! Log 758481
comedilib 0.11.0-1.1Undetected errorLog
comptty 1.0.1-4comp_tty.cxx:27:30: error: character too large for enclosing character literal type Log
connectagram 1.2.10-1DEPS Log
courier-authlib 0.69.0-2Undetected errorLog
cpl-plugin-muse 2.8.1+dfsg-1muse_lsf.c:219:8: error: loop iteration variable in the associated loop of 'omp parallel for' directive may not be shared, predetermined as private Log
crash 7.2.8-1Undetected errorLog
crawl 2:0.24.0-1Undetected errorLog
db5.3 5.3.28+dfsg1-0.6Undetected errorLog
dbus-python 1.2.16-1Undetected errorLog
dbuskit 0.1.1-3configure: error: "could not find runtime.h. DBusKit requires gnustep-base >=1.20." Log
ddcutil 0.9.8-2vcp_feature_codes.c:3992:20: error: initializer overrides prior initialization of this subobject [-Werror,-Winitializer-overrides] Log
dicom3tools 1.00~20190724083540-1./Imakefile:177:3: error: invalid preprocessing directive Log
directfb 1.7.7-9./String.h:126:51: error: format argument not a string type Log
djview4 4.11-2configure: error: Cannot successfully run Qt program qmake. Log
duo-unix 1.9.21-1.1dpkg-shlibdeps: error: cannot continue due to the error above Log
efibootmgr 17-1make[3]: *** No rule to make target 'efivar.h', needed by 'efibootmgr.o'. Stop. Log 753644
elfutils 0.176-1.1configure: error: gcc with GNU99 support required Log 758064
emacs 1:26.3+1-1Undetected errorLog
esys-particle 2.3.5+dfsg1-4./SphAggGougeBlock.hpp:39:37: error: no viable conversion from '__normal_iterator, std::allocator > >::const_pointer, [...]>' to '__normal_iterator, std::allocator > >::pointer, [...]>' Log
examl 3.0.21-3avxLikelihood.c:887:48: error: passing 'simde__m256d' to parameter of incompatible type 'simde__m256i' Log
fbpanel 7.0-4Undetected errorLog
fflas-ffpack 2.4.3-1configure: error: The Givaro library could not be used with the compiler and the flags set up by the configure script Log
fftw3 3.3.8-2configure: error: gcc 4.6 or later required for quad precision support Log
firebird3.0 3.0.5.33220.ds4-1libtool.m4: error: problem compiling CXX test program Log
firefox-esr 68.5.0esr-1configure: error: compiler is incompatible with sanitize options Log
fomp 1.2.0-1Undetected errorLog
fractalnow 0.8.2-4Undetected errorLog
gbsplay 0.0.93-3Undetected errorLog
gcc-8-cross-ports 26configure: error: in `/<>/gcc/build/x86_64-linux-gnux32/libhsail-rt' Log
gcc-python-plugin 0.17-5./gcc-semiprivate-types.h:280:19: error: field has incomplete type 'gimple_stmt_ptr' (aka 'gimple') Log
gdb 9.1-1Undetected errorLog
gdb-mingw-w64 10.9Undetected errorLog
gdbm 1.18.1-5configure: error: in `/<>/diet-build' Log
geant321 1:3.21.14.dfsg-11Undetected errorLog
gforth 0.7.3+dfsg-9Undetected errorLog
gnustep-base 1.26.0-6configure: error: Could not find Objective-C headers Log
google-perftools 2.7-1Undetected errorLog
gpg-remailer 3.04.05-1mail/../cleartextmail/../mailer/send.f:11:17: error: cannot cast 'Mailer' to its private base class 'MailerBase' Log
gr-radar 0.0.0.20180308-4[19] [20]/<>/lib/signal_generator_cw_c_impl.cc:89:29: error: implicit conversion from '_Complex double' to 'float' is not permitted in C++ Log
grml2usb 0.17.0mbr.S:38:16: error: cannot use more than one symbol in memory operand Log
gromacs 2020-2Undetected errorLog
grub 0.97-75configure: error: GRUB requires GAS .code16 addr32 support; upgrade your binutils Log
grub2 2.04-5configure: error: could not force soft-float Log
guitarix 0.39.0+dfsg1-1Undetected errorLog
haskell-alsa-mixer 0.3.0-1Undetected errorLog
haskell-ncurses 0.2.16-3Undetected errorLog
haskell-thyme 0.3.5.5-4Undetected errorLog
htslib 1.10.2-3configure: error: in `/<>' Log
hugs98 98.200609.21-5.4tools/make_bootlib: 68: -D__HUGS__: not found Log
imvirt 0.9.6-5vmware.c:65:5: error: invalid operand for instruction Log
iqtree 1.6.12+dfsg-1DEPS Log
irony-mode 1.4.0-1dh_auto_configure: error: cd obj-x86_64-linux-gnu && cmake -DCMAKE_INSTALL_PREFIX=/usr -DCMAKE_BUILD_TYPE=None -DCMAKE_INSTALL_SYSCONFDIR=/etc -DCMAKE_INSTALL_LOCALSTATEDIR=/var -DCMAKE_EXPORT_NO_PACKAGE_REGISTRY=ON -DCMAKE_FIND_PACKAGE_NO_PACKAGE_REGISTRY=ON -DCMAKE_INSTALL_RUNSTATEDIR=/run "-GUnix Makefiles" -DCMAKE_VERBOSE_MAKEFILE=ON -DCMAKE_INSTALL_LIBDIR=lib/x86_64-linux-gnu ../server returned exit code 1 Log
ivtools 1.2.11a2-4Undetected errorLog
jackd2 1.9.12~dfsg-2/bin/sh: 1: /usr/bin/licensecheck: not found Log 757820
jalv 1.6.4-1Undetected errorLog
js8call 2.1.1+ds-1f95: error: unrecognized command line option ‘-fopenmp=libomp’; did you mean ‘-fopenmp-simd’? Log
kraft 0.90-2datemodel.cpp:350:17: error: out-of-line declaration of a member must be a definition [-Wout-of-line-declaration] Log
kylin-video 2.0.1-1E: apt-cache returned no information about kylin-video source Log
lammps 20191120+dfsg1-2DEPS Log
ldb 2:2.0.8-1TypeError: unsupported operand type(s) for +: 'NoneType' and 'list' Log
libdata-uuid-perl 1.220-1Undetected errorLog
libdbi-drivers 0.9.0-8Undetected errorLog
libkkc 0.3.5-7Undetected errorLog
libmath-mpfr-perl 4.13-1have_d64.in:2:2: error: GNU decimal type extension not supported Log
libmdsp 0.11-10src/antoi.c:21:17: error: unknown kind of pragma comment Log
libomxalsa 0.1-2configure: error: POSIX threads support is required Log
libomxcamera 0.1-2configure: error: in `/<>' Log
libomxfbdevsink 0.1-2configure: error: in `/<>' Log
libomxmad 0.1-1configure: error: POSIX threads support is required Log
libomxvideosrc 0.1-1configure: error: in `/<>' Log
libomxvorbis 0.1-3configure: error: in `/<>' Log
libomxxvideo 0.1-3configure: error: POSIX threads support is required Log
libreoffice 1:6.4.1~rc1-2clang: error: unable to execute command: Killed Log
libwx-perl 1:0.9932-5dh_auto_configure: error: perl -I. Makefile.PL INSTALLDIRS=vendor "OPTIMIZE=-g -O2 -fdebug-prefix-map=/<>=. -fstack-protector-strong -Wformat -Werror=format-security -Wdate-time -D_FORTIFY_SOURCE=2" "LD=x86_64-linux-gnu-gcc -g -O2 -fdebug-prefix-map=/<>=. -fstack-protector-strong -Wformat -Werror=format-security -Wl,-z,relro -Wl,-z,now" returned exit code 2 Log
libwx-scintilla-perl 0.39-4Undetected errorLog
lierolibre 0.5-3./src/gvl/io/encoding.hpp:586:19: error: cast from pointer to smaller type 'uint32_t' (aka 'unsigned int') loses information Log
linbox 1.6.3-2Undetected errorLog
linux 5.4.19-1clang: error: unable to execute command: Aborted Log
lookup 1.08b-12lib/romaji2kana.c:59:12: error: source file is not valid UTF-8 Log
lordsawar 0.3.1-4armyproto.cpp:37:34: error: array initializer must be an initializer list Log
mafft 7.453-1Undetected errorLog
mariadb-10.3 1:10.3.22-1DEPS Log
mathomatic 16.0.5-2Undetected errorLog
mclibs 20061220+dfsg3-3.1Undetected errorLog
mda-lv2 1.2.4-1Undetected errorLog
memtest86 4.3.7-3main.c:229:2: error: indirect goto in function with no address-of-label expressions Log
memtest86+ 5.01-3.1main.c:223:2: error: indirect goto in function with no address-of-label expressions Log
mia 2.4.6-5src.cxx:5:2: error: Altivec not supported Log
mira 4.9.6-4configure: error: Could not link against boost_thread ! Log
mona 1.4-17-2configure: error: C++ compiler not found Log
mpich 3.3.2-2configure: error: Unable to configure with Fortran support because configure could not determine the size of a Fortran INTEGER. Consider setting CROSS_F77_SIZEOF_INTEGER to the length in bytes of a Fortran INTEGER Log
mrs 6.0.5+dfsg-7Undetected errorLog
myrescue 0.9.8-2Undetected errorLog
newsboat 2.18-2/usr/bin/curl-config: 1: krb5-config: not found Log
nim 1.0.6-1Undetected errorLog
nn 6.7.3-10make[2]: *** No rule to make target ' articles.h', needed by 'nn.o'. Stop. Log
norm 1.5.8+dfsg2-2Undetected errorLog
octave-interval 3.2.0-5Undetected errorLog
odb 2.4.0-12../odb/relational/header.hxx:56:24: error: non-const lvalue reference to type 'semantics::data_member' cannot bind to a value of unrelated type 'relational::header::image_member_impl::member_info' (aka 'relational::member_base_impl::member_info') Log
odil 0.11.0-1Undetected errorLog
ogmrip 1.0.1-2ogmrip-encoding.c:1200:7: error: cast to union type from type 'int' not present in union Log
opengrm-ngram 1.3.2-3Undetected errorLog
openhpi 3.8.0-2ipmi.cpp:1561:83: error: alias must point to a defined variable or function Log
openjade 1.4devel1-21.3configure: error: cannot compute sizeof (size_t) Log
openjdk-11 11.0.6+10-2if [ -n "`/usr/bin/nm /<>/build/hotspot/variant-server/libjvm/objs/access.o | /bin/grep -e _ZdaPv -e _ZdlPv -e _Znam -e _Znwm | /bin/grep ' U '`" ]; then /bin/echo "/<>/build/hotspot/variant-server/libjvm/objs/access.o: Error: Use of global operators new and delete is not allowed in Hotspot:"; /usr/bin/nm /<>/build/hotspot/variant-server/libjvm/objs/access.o | /usr/bin/c++filt | /bin/grep -E '[^:]operator (new|delete)' | /bin/grep ' U '; /bin/echo "See: /<>/make/hotspot/lib/CompileJvm.gmk"; exit 1; fi Log
openmpi 4.0.2-5configure: error: Cannot continue Log
openmsx 0.15.0-2src/utils/strCat.hh:424:8: error: 'auto' return without trailing return type; deduced return types are a C++14 extension Log
openmsx-catapult 0.15.0-2Undetected errorLog
openvpn-auth-ldap 2.0.4-1configure: error: Can't locate Objective C runtime headers Log
pan 0.146-1text-match.cc:476:8: error: no viable conversion from 'pan::StringView' to 'std::__cxx11::basic_string' Log
paraview 5.7.0-4Undetected errorLog
paw 1:2.14.04.dfsg.2-9.1Undetected errorLog
pencil2d 0.6.4-2DEPS Log
pinfo 0.6.13-1configure: error: in `/<>' Log
pingus 0.7.6-5src/lisp/getters.hpp:33:15: error: no viable conversion from 'std::shared_ptr' to 'const lisp::Lisp *' Log
pplpy 0.8.4-3E: apt-cache returned no information about pplpy source Log
prime-phylo 1.0.11-8ODESolver.hh:359:20: error: in-class initializer for static data member of type 'const beep::Real' (aka 'const double') requires 'constexpr' specifier [-Wstatic-float-init] Log
primus 0~20150328-9./gl-passthru.def:2:1: error: ifunc must point to a defined function Log
psi 1.3-5Undetected errorLog
pygalmesh 0.5.0-4E: apt-cache returned no information about pygalmesh source Log
pyqt5webengine 5.14.0-2dh_auto_configure: error: pybuild --configure -i python{version} -p "3.8 3.7" returned exit code 13 Log
python-gammu 2.12-1E: apt-cache returned no information about python-gammu source Log
python3.8 3.8.2~rc2-2configure: error: in `/<>/build-static' Log
qbrew 0.4.1-8Undetected errorLog
qca2 2.2.1-2sh: 1: error: Problems running dot: exit code=127, command='dot', arguments='"/<>/build/apidocs/html/classQCA_1_1ConsoleReference__coll__graph.dot" -Tpng -o "/<>/build/apidocs/html/classQCA_1_1ConsoleReference__coll__graph.png"' Log
qtop 2.3.4-2File.h:327:18: error: qualified reference to 'File' is a constructor name rather than a type in this context Log
qtwebkit-opensource-src 5.212.0~alpha3-7Undetected errorLog
quickfix 1.15.1+dfsg-2Undetected errorLog
quotatool 1:1.6.2-5configure: error: in `/<>' Log
raxml 8.2.12+dfsg-4avxLikelihood.c:2250:48: error: passing 'simde__m256d' to parameter of incompatible type 'simde__m256i' Log
ring 20190215.1.f152c98~ds1-1configure: error: dbus does not compile when clang is used, rerun with --without-dbus Log
roaraudio 1.0~beta12-3Undetected errorLog
s6 2.9.0.1-2Undetected errorLog
sagemath 9.0-1[sagelib-9.0] /usr/include/x86_64-linux-gnu/ppl.hh:66465:8: error: missing 'typename' prior to dependent type template name 'OR_Matrix::Pseudo_Row' Log
samblaster 0.1.24-2Undetected errorLog
scantool 2.0-1about.c:36:100: error: illegal character encoding in string literal [-Werror,-Winvalid-source-encoding] Log
scipy 1.3.3-3Undetected errorLog
simhash 0.0.20161225-1Undetected errorLog
sks-ecc 0.93-6tfm/mpi.c:2565:15: error: unknown register name '%cc' in asm Log
skypat 3.1.1-3Undetected errorLog
soundmodem 0.20-5../matlib/mat.hh:452:6: error: assigning to 'unsigned int *' from incompatible type 'void *' Log
sparse 0.6.1-2+/usr/include/stdio.h:27:11: error: unable to open 'bits/libc-header-start.h' Log
speedcrunch 0.12.0-4Undetected errorLog
stdsyslog 0.03.3-3stdsyslog.c:560:121: error: format specifies type 'void *' but the argument has type 'char *' [-Werror,-Wformat-pedantic] Log
subtitleeditor 0.54.0-3document.cc:81:40: error: addition of default argument on redeclaration makes this constructor a copy constructor Log
suil 0.10.6-1Undetected errorLog
talloc 2.3.0-3TypeError: unsupported operand type(s) for +: 'NoneType' and 'list' Log
tcptrack 1.4.2-2./IPAddress.h:19:58: error: all paths through this function will call itself [-Werror,-Winfinite-recursion] Log
tdb 1.4.2-3TypeError: unsupported operand type(s) for +: 'NoneType' and 'list' Log
thin-provisioning-tools 0.8.5-4Undetected errorLog
troffcvt 1.04-24Undetected errorLog
tvc 5.0.3+git20151221.80e144e+dfsg-2Utils.cpp:318:16: error: variable-sized object may not be initialized Log
u-boot 2020.01+dfsg-2Undetected errorLog
vokoscreen 2.5.0-3E: apt-cache returned no information about vokoscreen source Log
vsearch 2.14.1-3configure: error: in `/<>' Log
wsjtx 2.1.2+repack-2f95: error: unrecognized command line option ‘-fopenmp=libomp’; did you mean ‘-fopenmp-simd’? Log
wvstreams 4.6.1-14./include/wvscatterhash.h:186:46: error: invalid use of non-static data member 'xstatus' Log
xcftools 1.0.7-6Undetected errorLog
xdrawchem 1:1.10.2.1-3DEPS Log
xfsprogs 5.3.0-1configure: error: LTO not supported by compiler. Log
xmlcopyeditor 1.2.1.3-4myipc.cpp:49:4: error: cannot initialize a member subobject of type 'WXWidget' (aka '_GtkWidget *') with an rvalue of type 'wxIntPtr' (aka 'long') Log
xmms2 0.8+dfsg-18.2coll.h:615:6: error: binding reference of type 'Xmms::Coll::Coll' to value of type 'const Xmms::Coll::Coll' drops 'const' qualifier Log
xymon 4.3.30-1Undetected errorLog
yrmcds 1.1.8-1.1Undetected errorLog
z80ex 1.1.21-1dh_install: error: missing files, aborting Log
zeitgeist 1.0.2-3controller.cpp:131:19: error: cannot cast from type 'gboolean (ZeitgeistFTS::Controller::*)()' to pointer type 'GSourceFunc' (aka 'int (*)(void *)') Log
zeroc-ice 3.7.3-1include/generated/Ice/LocalException.h:3853:40: error: dynamic exception specifications are deprecated [-Werror,-Wdeprecated-dynamic-exception-spec] Log
zookeeper 3.4.13-5 [javadoc] /<>/src/java/main/org/apache/zookeeper/server/NettyServerCnxnFactory.java:21: error: package org.jboss.netty.buffer does not exist Log
zynaddsubfx 3.0.5-2PluginTest.h:235: Error: Assertion failed: fdata == result Log
zypper 1.14.11-2Exception.h:329:58: error: template parameter redefines default argument Log
199 errors
Return to the list