"No type named in namespace" build failure(s) — clang 3.1
| Package | Version | Supposed error message | Full log | Bug report |
|---|---|---|---|---|
| clam | 1.4.0-5.1 | scons/libs/core/include/CLAM/TypeInfo.hxx:30:27: error: no type named 'type_info' in namespace 'std' | Log | |
| clam-chordata | 1.0.0-2 | TypeInfo.hxx:30:27: error: no type named 'type_info' in namespace 'std' | Log | |
| plasma-widget-smooth-tasks | 0.0~wip20100227-1.1 | Task.h:79:15: error: no type named 'TaskPtr' in namespace 'TaskManager' | Log |
3 errors