"No type named in namespace" build failure(s) — clang 3.6.0

PackageVersionSupposed error messageFull log Bug report
clam 1.4.0-6scons/libs/core/include/CLAM/TypeInfo.hxx:30:27: error: no type named 'type_info' in namespace 'std' Log
clam-networkeditor 1.4.0-3.1TypeInfo.hxx:30:27: error: no type named 'type_info' in namespace 'std' Log
gfal2 2.7.8-2davfile.hpp:75:17: error: no type named 'shared_ptr' in namespace 'std' Log

3 errors