"No type named in namespace" build failure(s) — clang 3.4.2

PackageVersionSupposed error messageFull log Bug report
clam 1.4.0-5.2scons/libs/core/include/CLAM/TypeInfo.hxx:30:27: error: no type named 'type_info' in namespace 'std' Log
clam-networkeditor 1.4.0-3.1TypeInfo.hxx:30:27: error: no type named 'type_info' in namespace 'std' Log
sumo 0.20.0+dfsg-1../../../src/utils/common/SUMOVehicle.h:207:44: error: no type named 'type_info' in namespace 'std' Log

3 errors