Debian Package rebuild

Rebuild of the Debian archive with clang

"Change symbol in libs" build failure(s)
clang 9.0.1
Return to the list
Some differences in the list of symbol in the binary causes the Debian symbol check for ABI changes to fail.

For example, this has been reported with a test case in upstream bug: https://llvm.org/bugs/show_bug.cgi?id=30441 (fixed now)
or https://bugs.llvm.org/show_bug.cgi?id=45322
Versions: 2.9 - 3.0 - 3.1 - 3.2 - 3.3 - 3.4 - 3.4.2 - 3.5.0 - 3.6.0 - 3.8.1 - 3.9.1 - 4.0.1 - 5.0 - 6.0 - 8.0.1 - 9.0.1 - 10
PackageVersionSupposed error messageFull log Bug report
afflib 3.7.18-4dpkg-gensymbols: error: some symbols or patterns disappeared in the symbols file: see diff output below Log
agg 1:2.6.0-r132+dfsg1-3dpkg-gensymbols: error: some symbols or patterns disappeared in the symbols file: see diff output below Log
atlas-cpp 0.6.4-2dpkg-gensymbols: error: some symbols or patterns disappeared in the symbols file: see diff output below Log
attica-kf5 5.62.0-1dpkg-gensymbols: error: some symbols or patterns disappeared in the symbols file: see diff output below Log
audacious 3.10.1-1dpkg-gensymbols: error: some symbols or patterns disappeared in the symbols file: see diff output below Log
bitz-server 2.0.3-1dpkg-gensymbols: error: some symbols or patterns disappeared in the symbols file: see diff output below Log
bluez-qt 5.62.0-1dpkg-gensymbols: error: some symbols or patterns disappeared in the symbols file: see diff output below Log
c-icap 1:0.5.3-3dpkg-gensymbols: error: some symbols or patterns disappeared in the symbols file: see diff output below Log
cjs 4.4.0-4dpkg-gensymbols: error: some symbols or patterns disappeared in the symbols file: see diff output below Log
clutter-1.0 1.26.2+dfsg-13dpkg-gensymbols: error: some new symbols appeared in the symbols file: see diff output below Log
coinor-vol 1.5.4-3dpkg-gensymbols: error: some symbols or patterns disappeared in the symbols file: see diff output below Log
crossguid 0.0+git200150803-4dpkg-gensymbols: error: some symbols or patterns disappeared in the symbols file: see diff output below Log
ctpp2 2.8.3-26dpkg-gensymbols: error: some symbols or patterns disappeared in the symbols file: see diff output below Log
dolphin 4:19.08.1-1dpkg-gensymbols: error: some symbols or patterns disappeared in the symbols file: see diff output below Log
double-conversion 3.1.5-5dpkg-gensymbols: error: some symbols or patterns disappeared in the symbols file: see diff output below Log
evolution-data-server 3.34.3-2dpkg-gensymbols: error: some new symbols appeared in the symbols file: see diff output below Log
exiv2 0.27.2-8dpkg-gensymbols: error: some symbols or patterns disappeared in the symbols file: see diff output below Log
fcitx-qt5 1.2.4-1dpkg-gensymbols: error: some symbols or patterns disappeared in the symbols file: see diff output below Log
flatbuffers 1.11.0+dfsg1-1.1dpkg-gensymbols: error: some symbols or patterns disappeared in the symbols file: see diff output below Log
game-music-emu 0.6.2-1dpkg-gensymbols: error: some new symbols appeared in the symbols file: see diff output below Log
gatb-core 1.4.1+git20191209.9398f28+dfsg-3dpkg-gensymbols: error: some symbols or patterns disappeared in the symbols file: see diff output below Log
htmlcxx 0.86-1.3dpkg-gensymbols: error: some symbols or patterns disappeared in the symbols file: see diff output below Log
jemalloc 5.2.1-1dpkg-gensymbols: error: some symbols or patterns disappeared in the symbols file: see diff output below Log
jthread 1.3.1-3dpkg-gensymbols: error: some symbols or patterns disappeared in the symbols file: see diff output below Log
kaccounts-integration 4:17.08.3-1dpkg-gensymbols: error: some symbols or patterns disappeared in the symbols file: see diff output below Log
karchive 5.62.0-1dpkg-gensymbols: error: some symbols or patterns disappeared in the symbols file: see diff output below Log
kcmutils 5.62.0-1dpkg-gensymbols: error: some symbols or patterns disappeared in the symbols file: see diff output below Log
kcodecs 5.62.0-1dpkg-gensymbols: error: some symbols or patterns disappeared in the symbols file: see diff output below Log
kcompletion 5.62.0-1dpkg-gensymbols: error: some symbols or patterns disappeared in the symbols file: see diff output below Log
kconfig 5.62.0-1dpkg-gensymbols: error: some symbols or patterns disappeared in the symbols file: see diff output below Log
kconfigwidgets 5.62.0-1dpkg-gensymbols: error: some symbols or patterns disappeared in the symbols file: see diff output below Log
kcoreaddons 5.62.0-1dpkg-gensymbols: error: some symbols or patterns disappeared in the symbols file: see diff output below Log
kdb 3.2.0-4dpkg-gensymbols: error: some symbols or patterns disappeared in the symbols file: see diff output below Log
kdecoration 4:5.17.5-2dpkg-gensymbols: error: some symbols or patterns disappeared in the symbols file: see diff output below Log
kdelibs4support 5.62.0-2dpkg-gensymbols: error: some symbols or patterns disappeared in the symbols file: see diff output below Log
kemoticons 5.62.0-1dpkg-gensymbols: error: some symbols or patterns disappeared in the symbols file: see diff output below Log
kfilemetadata-kf5 5.62.0-1dpkg-gensymbols: error: some symbols or patterns disappeared in the symbols file: see diff output below Log
kglobalaccel 5.62.0-1dpkg-gensymbols: error: some symbols or patterns disappeared in the symbols file: see diff output below Log
khtml 5.62.0-1dpkg-gensymbols: error: some symbols or patterns disappeared in the symbols file: see diff output below Log
kiconthemes 5.62.0-1dpkg-gensymbols: error: some symbols or patterns disappeared in the symbols file: see diff output below Log
kidletime 5.62.0-1dpkg-gensymbols: error: some symbols or patterns disappeared in the symbols file: see diff output below Log
kio 5.62.1-2dpkg-gensymbols: error: some symbols or patterns disappeared in the symbols file: see diff output below Log
kitemmodels 5.62.0-1dpkg-gensymbols: error: some symbols or patterns disappeared in the symbols file: see diff output below Log
kitemviews 5.62.0-1dpkg-gensymbols: error: some symbols or patterns disappeared in the symbols file: see diff output below Log
kiten 4:17.08.3-1dpkg-gensymbols: error: some symbols or patterns disappeared in the symbols file: see diff output below Log
kjobwidgets 5.62.0-1dpkg-gensymbols: error: some symbols or patterns disappeared in the symbols file: see diff output below Log
kjs 5.62.0-1dpkg-gensymbols: error: some symbols or patterns disappeared in the symbols file: see diff output below Log
kjsembed 5.62.0-1dpkg-gensymbols: error: some symbols or patterns disappeared in the symbols file: see diff output below Log
kmediaplayer 5.62.0-1dpkg-gensymbols: error: some symbols or patterns disappeared in the symbols file: see diff output below Log
knewstuff 5.62.0-1dpkg-gensymbols: error: some symbols or patterns disappeared in the symbols file: see diff output below Log
knotifications 5.62.0-1dpkg-gensymbols: error: some symbols or patterns disappeared in the symbols file: see diff output below Log
kparts 5.62.0-1dpkg-gensymbols: error: some symbols or patterns disappeared in the symbols file: see diff output below Log
kproperty 3.2.0-1dpkg-gensymbols: error: some symbols or patterns disappeared in the symbols file: see diff output below Log
kreport 3.2.0-1dpkg-gensymbols: error: some symbols or patterns disappeared in the symbols file: see diff output below Log
kross 5.62.0-1dpkg-gensymbols: error: some symbols or patterns disappeared in the symbols file: see diff output below Log
kservice 5.62.0-1dpkg-gensymbols: error: some symbols or patterns disappeared in the symbols file: see diff output below Log
ktexteditor 5.62.0-1dpkg-gensymbols: error: some symbols or patterns disappeared in the symbols file: see diff output below Log
kwallet-kf5 5.62.0-1dpkg-gensymbols: error: some symbols or patterns disappeared in the symbols file: see diff output below Log
kwayland 4:5.62.0-2dpkg-gensymbols: error: some symbols or patterns disappeared in the symbols file: see diff output below Log
kwidgetsaddons 5.62.0-1dpkg-gensymbols: error: some symbols or patterns disappeared in the symbols file: see diff output below Log
kwin 4:5.17.5-2dpkg-gensymbols: error: some symbols or patterns disappeared in the symbols file: see diff output below Log
lib3mf 1.8.1+ds-3dpkg-gensymbols: error: some symbols or patterns disappeared in the symbols file: see diff output below Log
libbpp-core 2.4.1-4dpkg-gensymbols: error: some symbols or patterns disappeared in the symbols file: see diff output below Log
libbpp-phyl 2.4.1-3dpkg-gensymbols: error: some symbols or patterns disappeared in the symbols file: see diff output below Log
libbpp-qt 2.4.1-3dpkg-gensymbols: error: some symbols or patterns disappeared in the symbols file: see diff output below Log
libbpp-raa 2.4.1-3dpkg-gensymbols: error: some symbols or patterns disappeared in the symbols file: see diff output below Log
libbpp-seq 2.4.1-4dpkg-gensymbols: error: some symbols or patterns disappeared in the symbols file: see diff output below Log
libbpp-seq-omics 2.4.1-4dpkg-gensymbols: error: some symbols or patterns disappeared in the symbols file: see diff output below Log
libcec 4.0.4+dfsg1-4dpkg-gensymbols: error: some symbols or patterns disappeared in the symbols file: see diff output below Log
libecap 1.0.1-3.2dpkg-gensymbols: error: some symbols or patterns disappeared in the symbols file: see diff output below Log
libedlib 1.2.4-2dpkg-gensymbols: error: some symbols or patterns disappeared in the symbols file: see diff output below Log
libfastahack 1.0.0+dfsg-5dpkg-gensymbols: error: some symbols or patterns disappeared in the symbols file: see diff output below Log
libfm-qt 0.14.1-12dpkg-gensymbols: error: some symbols or patterns disappeared in the symbols file: see diff output below Log
libgenome 1.3.11+svn20110227.4616-2dpkg-gensymbols: error: some symbols or patterns disappeared in the symbols file: see diff output below Log
libgphoto2 2.5.23-2dpkg-gensymbols: error: some symbols or patterns disappeared in the symbols file: see diff output below Log
libgzstream 1.5+dfsg-4dpkg-gensymbols: error: some symbols or patterns disappeared in the symbols file: see diff output below Log
libkdegames 4:19.08.1-2dpkg-gensymbols: error: some symbols or patterns disappeared in the symbols file: see diff output below Log
libkolabxml 1.1.6-6dpkg-gensymbols: error: some symbols or patterns disappeared in the symbols file: see diff output below Log
libkscreen 4:5.17.5-3dpkg-gensymbols: error: some symbols or patterns disappeared in the symbols file: see diff output below Log
libksysguard 4:5.17.5-2dpkg-gensymbols: error: some symbols or patterns disappeared in the symbols file: see diff output below Log
libktorrent 2.1.1-2dpkg-gensymbols: error: some symbols or patterns disappeared in the symbols file: see diff output below Log
liblxqt 0.14.1-4dpkg-gensymbols: error: some symbols or patterns disappeared in the symbols file: see diff output below Log
libmuscle 3.7+4565-6dpkg-gensymbols: error: some symbols or patterns disappeared in the symbols file: see diff output below Log
libmygpo-qt 1.1.0-3dpkg-gensymbols: error: some symbols or patterns disappeared in the symbols file: see diff output below Log
libncl 2.1.21+git20190531.feceb81-2dpkg-gensymbols: error: some symbols or patterns disappeared in the symbols file: see diff output below Log
libnitrokey 3.4.1-4dpkg-gensymbols: error: some symbols or patterns disappeared in the symbols file: see diff output below Log
libofa 0.9.3-21dpkg-gensymbols: error: some symbols or patterns disappeared in the symbols file: see diff output below Log
libopendbx 1.4.6-13dpkg-gensymbols: error: some symbols or patterns disappeared in the symbols file: see diff output below Log
libpgf 6.14.12-3.2dpkg-gensymbols: error: some symbols or patterns disappeared in the symbols file: see diff output below Log
libpolyclipping 6.4.2-6dpkg-gensymbols: error: some symbols or patterns disappeared in the symbols file: see diff output below Log
libprelude 5.1.1-4dpkg-gensymbols: error: some symbols or patterns disappeared in the symbols file: see diff output below Log
libpreludedb 5.1.0-4dpkg-gensymbols: error: some symbols or patterns disappeared in the symbols file: see diff output below Log
libquazip 0.7.6-6dpkg-gensymbols: error: some symbols or patterns disappeared in the symbols file: see diff output below Log
libsavitar 4.4.1-2dpkg-gensymbols: error: some symbols or patterns disappeared in the symbols file: see diff output below Log
libseqlib 1.1.2+dfsg-6dpkg-gensymbols: error: some symbols or patterns disappeared in the symbols file: see diff output below Log
libsigc++-2.0 2.10.2-1dpkg-gensymbols: error: some symbols or patterns disappeared in the symbols file: see diff output below Log
libsmithwaterman 0.0+git20160702.2610e25-7dpkg-gensymbols: error: some symbols or patterns disappeared in the symbols file: see diff output below Log
libsndfile 1.0.28-7dpkg-gensymbols: error: some symbols or patterns disappeared in the symbols file: see diff output below Log
libthread-pool 2.0.1-4dpkg-gensymbols: error: some symbols or patterns disappeared in the symbols file: see diff output below Log
libunivalue 1.0.4-2dpkg-gensymbols: error: some symbols or patterns disappeared in the symbols file: see diff output below Log
libxml2 2.9.10+dfsg-3dpkg-gensymbols: error: some new symbols appeared in the symbols file: see diff output below Log
libzen 0.4.37-1dpkg-gensymbols: error: some symbols or patterns disappeared in the symbols file: see diff output below Log
marble 4:19.12.0-1dpkg-gensymbols: error: some symbols or patterns disappeared in the symbols file: see diff output below Log
mkl-dnn 2.0~beta4-1dpkg-gensymbols: error: some symbols or patterns disappeared in the symbols file: see diff output below Log
mpfr4 4.0.2-1dpkg-gensymbols: error: some symbols or patterns disappeared in the symbols file: see diff output below Log
networkmanager-qt 5.62.0-1dpkg-gensymbols: error: some symbols or patterns disappeared in the symbols file: see diff output below Log
notmuch 0.29.3-1dpkg-gensymbols: error: some symbols or patterns disappeared in the symbols file: see diff output below Log
nut 2.7.4-12dpkg-gensymbols: error: some symbols or patterns disappeared in the symbols file: see diff output below Log
okteta 5:0.26.3-1dpkg-gensymbols: error: some symbols or patterns disappeared in the symbols file: see diff output below Log
p8-platform 2.1.0.1+dfsg1-3dpkg-gensymbols: error: some symbols or patterns disappeared in the symbols file: see diff output below Log
pacemaker 2.0.3-3dpkg-gensymbols: error: some symbols or patterns disappeared in the symbols file: see diff output below Log
plasma-workspace 4:5.17.5-4dpkg-gensymbols: error: some symbols or patterns disappeared in the symbols file: see diff output below Log
pocl 1.4-6dpkg-gensymbols: error: some symbols or patterns disappeared in the symbols file: see diff output below Log
polkit-qt-1 0.112.0-7.1dpkg-gensymbols: error: some symbols or patterns disappeared in the symbols file: see diff output below Log
prison-kf5 5.62.0-1dpkg-gensymbols: error: some symbols or patterns disappeared in the symbols file: see diff output below Log
psocksxx 1.1.1-1dpkg-gensymbols: error: some symbols or patterns disappeared in the symbols file: see diff output below Log
pugixml 1.10-1dpkg-gensymbols: error: some symbols or patterns disappeared in the symbols file: see diff output below Log
pulseaudio-qt 1.2-2dpkg-gensymbols: error: some symbols or patterns disappeared in the symbols file: see diff output below Log
purpose 5.62.0-2dpkg-gensymbols: error: some symbols or patterns disappeared in the symbols file: see diff output below Log
qqwing 1.3.4-1.1dpkg-gensymbols: error: some symbols or patterns disappeared in the symbols file: see diff output below Log
qtspell 0.8.5-5dpkg-gensymbols: error: some symbols or patterns disappeared in the symbols file: see diff output below Log
silly 0.1.0-8dpkg-gensymbols: error: some symbols or patterns disappeared in the symbols file: see diff output below Log
sleuthkit 4.6.7-1dpkg-gensymbols: error: some symbols or patterns disappeared in the symbols file: see diff output below Log
snacc 1.3.1-7dpkg-gensymbols: error: some symbols or patterns disappeared in the symbols file: see diff output below Log
snapd-glib 1.54-1dpkg-gensymbols: error: some new symbols appeared in the symbols file: see diff output below Log
sonnet 5.62.0-1dpkg-gensymbols: error: some symbols or patterns disappeared in the symbols file: see diff output below Log
spdlog 1:1.5.0-1dpkg-gensymbols: error: some symbols or patterns disappeared in the symbols file: see diff output below Log
spoa 3.0.1-1dpkg-gensymbols: error: some symbols or patterns disappeared in the symbols file: see diff output below Log
swami 2.2.0-2dpkg-gensymbols: error: some symbols or patterns disappeared in the symbols file: see diff output below Log
syndication 1:5.62.0-3dpkg-gensymbols: error: some symbols or patterns disappeared in the symbols file: see diff output below Log
systemc 2.3.3-4dpkg-gensymbols: error: some symbols or patterns disappeared in the symbols file: see diff output below Log
teckit 2.5.8+ds2-5dpkg-gensymbols: error: some symbols or patterns disappeared in the symbols file: see diff output below Log
telepathy-logger-qt 17.08.0-4dpkg-gensymbols: error: some symbols or patterns disappeared in the symbols file: see diff output below Log
telepathy-qt 0.9.8+ds-2dpkg-gensymbols: error: some symbols or patterns disappeared in the symbols file: see diff output below Log
varconf 1.0.1-6dpkg-gensymbols: error: some symbols or patterns disappeared in the symbols file: see diff output below Log
waylandpp 0.2.5-2dpkg-gensymbols: error: some symbols or patterns disappeared in the symbols file: see diff output below Log
xbase64 3.1.2-13dpkg-gensymbols: error: some symbols or patterns disappeared in the symbols file: see diff output below Log
137 errors
Return to the list