| Package | Version | Supposed error message | Full log |
Bug report |
| 0ad | 0.0.23.1-4 | ../../build/unix/gold/ld: error: hidden symbol 'ceil' is not defined locally
| Log |
|
| aconnectgui | 0.9.0rc2-1-10 | configure: error: Sufficiently new version of libasound not found.
| Log |
684508
|
| acpid | 1:2.0.32-1 | configure: error: "asprintf() not found"
| Log |
|
| afnix | 2.9.2-2 | Undetected error | Log |
|
| altermime | 0.3.10-11 | Undetected error | Log |
753058
|
| android-platform-libnativehelper | 8.1.0+r23-1 | ld: final link failed: bad value
| Log |
|
| ap51-flash | 2019.0.1-2 |
| Log |
|
| aplus-fsf | 4.22.1-10.1 | configure: error: in `/<>'
| Log |
|
| apron | 0.9.10-9.1 | ppl.hh:66465:8: error: missing 'typename' prior to dependent type template name 'OR_Matrix::Pseudo_Row'
| Log |
|
| aptitude | 0.8.12-3 | configure: error: need libapt-pkg 0.7 or later
| Log |
|
| arj | 3.10.22-23 | Undetected error | Log |
|
| auto-07p | 0.9.2+dfsg-3 | configure: error: COIN3D is not installed
| Log |
|
| autodocksuite | 4.2.6-7 | configure: error: in `/<>/autodock'
| Log |
|
| avifile | 1:0.7.48~20090503.ds-20.1 | common/avm_output.cpp:20:12: error: qualified reference to 'AvmOutput' is a constructor name rather than a type in this context
| Log |
|
| ball | 1.5.0+git20180813.37fc53c-6 | Undetected error | Log |
755225
|
| baresip | 0.6.1-1 | dh_install: error: missing files, aborting
| Log |
|
| bedops | 2.4.39+dfsg-1 | ../../../../interfaces/general-headers/utility/BitMonitor.hpp:89:19: error: cannot assign to non-static data member within const member function 'next_set'
| Log |
|
| belr | 0.1.3-2 | new_allocator.h:153:4: error: destructor called on non-final 'belr::ParserHandler, std::shared_ptr >' that has virtual functions but non-virtual destructor [-Werror,-Wdelete-non-abstract-non-virtual-dtor]
| Log |
|
| bind-dyndb-ldap | 11.2-1 | ../../src/mldap.c:122:3: error: used type 'typeof (((isc_refcount_t *)0)->refs)' (aka '_Atomic(int_fast32_t)') where arithmetic or pointer type is required
| Log |
|
| binutils | 2.34-6 | Undetected error | Log |
|
| binutils-avr | 2.26.20160125+Atmel3.6.2-1 | Undetected error | Log |
|
| binutils-mingw-w64 | 8.9 | Undetected error | Log |
|
| binutils-z80 | 4 | Undetected error | Log |
|
| bmusb | 0.7.5-1 | bmusb.cpp:641:16: error: 'target' attribute takes one argument
| Log |
|
| boinc | 7.16.6+dfsg-1 | configure: error: in `/<>'
| Log |
|
| boost1.67 | 1.67.0-17 | dh_install: error: missing files, aborting
| Log |
|
| boost1.71 | 1.71.0-6 | dh_install: error: missing files, aborting
| Log |
|
| busybox | 1:1.30.1-4 | Undetected error | Log |
|
| bzrtp | 1.0.6-3 | Undetected error | Log |
|
| castxml | 0.3.3-3 | dh_auto_configure: error: cd obj-x86_64-linux-gnu && cmake -DCMAKE_INSTALL_PREFIX=/usr -DCMAKE_BUILD_TYPE=None -DCMAKE_INSTALL_SYSCONFDIR=/etc -DCMAKE_INSTALL_LOCALSTATEDIR=/var -DCMAKE_EXPORT_NO_PACKAGE_REGISTRY=ON -DCMAKE_FIND_PACKAGE_NO_PACKAGE_REGISTRY=ON "-GUnix Makefiles" -DCMAKE_VERBOSE_MAKEFILE=ON -DCMAKE_AUTOGEN_VERBOSE=ON -DCMAKE_INSTALL_LIBDIR=lib/x86_64-linux-gnu -DCastXML_INSTALL_DOC_DIR:STRING=/usr/share/doc/castxml -DLLVM_DIR=/usr/lib/llvm-4.0/cmake .. returned exit code 1
| Log |
|
| ccls | 0.20190823.6-1 | dh_auto_configure: error: cd obj-x86_64-linux-gnu && cmake -DCMAKE_INSTALL_PREFIX=/usr -DCMAKE_BUILD_TYPE=None -DCMAKE_INSTALL_SYSCONFDIR=/etc -DCMAKE_INSTALL_LOCALSTATEDIR=/var -DCMAKE_EXPORT_NO_PACKAGE_REGISTRY=ON -DCMAKE_FIND_PACKAGE_NO_PACKAGE_REGISTRY=ON -DCMAKE_INSTALL_RUNSTATEDIR=/run "-GUnix Makefiles" -DCMAKE_VERBOSE_MAKEFILE=ON -DCMAKE_AUTOGEN_VERBOSE=ON -DCMAKE_INSTALL_LIBDIR=lib/x86_64-linux-gnu -DCCLS_VERSION=0.20190823.6-1 -DCLANG_RESOURCE_DIR=/usr/include/clang/10 .. returned exit code 1
| Log |
|
| cernlib | 20061220+dfsg3-4.4 | Undetected error | Log |
|
| clfft | 2.12.2-1 | dh_install: error: missing files, aborting
| Log |
|
| cog | 0.6.0-1 | cog-launcher.c:529:9: error: cannot jump from this goto statement to its label
| Log |
|
| collectd | 5.11.0-2 | configure: error: strtok_r is not available. Please file a bugreport!
| Log |
758481
|
| comedilib | 0.11.0-1.1 | Undetected error | Log |
|
| comptty | 1.0.1-4 | comp_tty.cxx:27:30: error: character too large for enclosing character literal type
| Log |
|
| cpl-plugin-muse | 2.8.1+dfsg-1 | muse_lsf.c:219:8: error: loop iteration variable in the associated loop of 'omp parallel for' directive may not be shared, predetermined as private
| Log |
|
| crawl | 2:0.24.0-1 | Undetected error | Log |
|
| cura-engine | 1:4.5.0-2 | layerPart.cpp:77:56: error: variable 'total_layers' must have explicitly specified data sharing attributes
| Log |
|
| db5.3 | 5.3.28+dfsg1-0.6 | Undetected error | Log |
|
| dbuskit | 0.1.1-3 | configure: error: "could not find runtime.h. DBusKit requires gnustep-base >=1.20."
| Log |
|
| dicom3tools | 1.00~20190724083540-1 | ./Imakefile:177:3: error: invalid preprocessing directive
| Log |
|
| digikam | 4:6.4.0+dfsg-3 | cv_image.h:128:18: error: no viable conversion from 'const cv::Mat' to 'IplImage' (aka '_IplImage')
| Log |
|
| directfb | 1.7.7-9 | ./String.h:126:51: error: format argument not a string type
| Log |
|
| dlm | 4.0.9-1 | Undetected error | Log |
|
| doomsday | 2.2.2+ds1-1 | Undetected error | Log |
|
| dpuser | 4.0+dfsg-2 | Undetected error | Log |
|
| dune-pdelab | 2.6~20180302-2 | owneroverlapcopy.hh:292:18: error: assigning to 'SolverCategory::Category' from incompatible type 'Dune::SolverCategory'
| Log |
|
| dynare | 4.6.1-1 | local_state_space_iteration_2.cc:97:35: error: reference to local binding 'ii1' declared in enclosing function 'ss2Iteration_pruning'
| Log |
|
| efibootmgr | 17-1 | make[3]: *** No rule to make target 'efivar.h', needed by 'efibootmgr.o'. Stop.
| Log |
753644
|
| efitools | 1.9.2-1 | Undetected error | Log |
|
| elfutils | 0.176-1.1 | configure: error: gcc with GNU99 support required
| Log |
758064
|
| esys-particle | 2.3.5+dfsg1-4 | ./SphAggGougeBlock.hpp:39:37: error: no viable conversion from '__normal_iterator, std::allocator > >::const_pointer, [...]>' to '__normal_iterator, std::allocator > >::pointer, [...]>'
| Log |
|
| f2j | 0.8.1+dfsg-4 | clang: error: clang frontend command failed due to signal (use -v to see invocation)
| Log |
|
| fbpanel | 7.0-4 | Undetected error | Log |
|
| fflas-ffpack | 2.4.3-1 | configure: error: The Givaro library could not be used with the compiler and the flags set up by the configure script
| Log |
|
| fftw3 | 3.3.8-2 | configure: error: gcc 4.6 or later required for quad precision support
| Log |
|
| firebird3.0 | 3.0.5.33220.ds4-1 | libtool.m4: error: problem compiling CXX test program
| Log |
|
| firefox-esr | 68.7.0esr-1 | configure: error: compiler is incompatible with sanitize options
| Log |
|
| fontforge | 1:20190801~dfsg-4 | /bin/bash: git: command not found
| Log |
|
| gbsplay | 0.0.93-3 | Undetected error | Log |
|
| gcc-h8300-hms | 1:3.4.6+dfsg2-4.1 | Undetected error | Log |
|
| gcc-mingw-w64 | 22 | Undetected error | Log |
|
| gcl | 2.6.12-95 | Undetected error | Log |
|
| gdb | 9.1-3 | Undetected error | Log |
|
| geant321 | 1:3.21.14.dfsg-11 | Undetected error | Log |
|
| generator-scripting-language | 4.1.5-3 | Undetected error | Log |
|
| getfem++ | 5.3+dfsg1-3 | configure: error: g++ do not support option -std=c++11. Update g++ to at least release 4.8.1.
| Log |
|
| gforth | 0.7.3+dfsg-9 | Undetected error | Log |
|
| gnustep-base | 1.26.0-7 | configure: error: Could not find Objective-C headers
| Log |
|
| goldendict | 1.5.0~rc2+git20190930+ds-2 | E: apt-cache returned no information about goldendict source
| Log |
|
| google-perftools | 2.7-1 | Undetected error | Log |
|
| gpg-remailer | 3.04.05-1 | mail/../cleartextmail/../mailer/send.f:11:17: error: cannot cast 'Mailer' to its private base class 'MailerBase'
| Log |
|
| gr-radar | 0.0.0.20180308-4 | (./refman.out) (./refman.out)/<>/lib/signal_generator_cw_c_impl.cc:89:29: error: implicit conversion from '_Complex double' to 'float' is not permitted in C++
| Log |
|
| gromacs | 2020.2-2 | Undetected error | Log |
|
| grr.app | 1.0-1 |
| Log |
|
| grub | 0.97-75 | configure: error: GRUB requires GAS .code16 addr32 support; upgrade your binutils
| Log |
|
| grub2 | 2.04-7 | configure: error: could not force soft-float
| Log |
|
| gtksourceview2 | 2.10.5-3 |
| Log |
|
| haskell-alsa-mixer | 0.3.0-1 | Undetected error | Log |
|
| haskell-dbus | 1.2.7-1 | Undetected error | Log |
|
| haskell-ncurses | 0.2.16-3 | Undetected error | Log |
|
| haskell-thyme | 0.3.5.5-4 | Undetected error | Log |
|
| helpviewer.app | 0.3-8 | clang: error: invalid value 'ISO-8859-1' in '-finput-charset=ISO-8859-1'
| Log |
|
| ho22bus | 0.9.1-2 | W: Unable to locate package ho22bus
| Log |
|
| htslib | 1.10.2-3 | configure: error: in `/<>'
| Log |
|
| hugs98 | 98.200609.21-5.4 | tools/make_bootlib: 68: -D__HUGS__: not found
| Log |
|
| hylafax | 3:6.0.7-3 | Undetected error | Log |
|
| imvirt | 0.9.6-6 | vmware.c:65:5: error: invalid operand for instruction
| Log |
|
| insighttoolkit4 | 4.13.2-dfsg1-9 | itkBalloonForceFilter.hxx:1091:18: error: assigning to 'float **' from incompatible type 'void *'
| Log |
|
| ivtools | 1.2.11a3-1 | Undetected error | Log |
|
| js8call | 2.1.1+ds-1 | f95: error: unrecognized command line option ‘-fopenmp=libomp’; did you mean ‘-fopenmp-simd’?
| Log |
|
| kraft | 0.90-2 | datemodel.cpp:350:17: error: out-of-line declaration of a member must be a definition [-Wout-of-line-declaration]
| Log |
|
| krita | 1:4.2.9+dfsg-1 | intrinsics.h:601:13: error: argument to '__builtin_ia32_vec_ext_v4sf' must be a constant integer
| Log |
|
| kvmtool | 0.20170904-1.1 | x86/bios/e820.c:36:15: error: unexpected token in argument list
| Log |
|
| lam | 7.1.4-6 | configure: error: *** Cannot continue.
| Log |
|
| lammps | 20200303+dfsg1-2 | lal_lj_tip4p_long.cpp:386:16: error: explicit instantiation of 'LAMMPS_AL::LJ_TIP4PLong' must occur in namespace 'LAMMPS_AL'
| Log |
|
| le | 1.16.5-0.1 | DEPS
| Log |
|
| libdbi-drivers | 0.9.0-9 | Undetected error | Log |
|
| libelfin | 0.3-1 | ./data.hh:558:22: error: cannot assign to non-static data member within const member function 'set_binding'
| Log |
|
| libgtkdatabox | 1:0.9.3.1-1 | Undetected error | Log |
|
| libkkc | 0.3.5-7 | Undetected error | Log |
|
| libktorrent | 2.1.1-2 | Undetected error | Log |
|
| libmath-mpfr-perl | 4.13-1 | have_d64.in:2:2: error: GNU decimal type extension not supported
| Log |
|
| libmdsp | 0.11-10 | src/antoi.c:21:17: error: unknown kind of pragma comment
| Log |
|
| libomxalsa | 0.1-2 | configure: error: POSIX threads support is required
| Log |
|
| libomxcamera | 0.1-2 | configure: error: in `/<>'
| Log |
|
| libomxfbdevsink | 0.1-2 | configure: error: in `/<>'
| Log |
|
| libomxmad | 0.1-1 | configure: error: POSIX threads support is required
| Log |
|
| libomxvideosrc | 0.1-1 | configure: error: in `/<>'
| Log |
|
| libomxvorbis | 0.1-3 | configure: error: in `/<>'
| Log |
|
| libomxxvideo | 0.1-3 | configure: error: POSIX threads support is required
| Log |
|
| libpwiz | 3.0.18342-2 | pwiz/data/common/BinaryIndexStream.cpp:159:15: error: cannot assign to non-static data member within const member function 'operator[]'
| Log |
758322
|
| libratbag | 0.13-1 | ../ratbagd/ratbagd-json.c:536:3: error: cannot jump from this goto statement to its label
| Log |
|
| librcsb-core-wrapper | 1.005-8 | Undetected error | Log |
|
| libreoffice | 1:6.4.4~rc1-1 | formulagroupcl.cxx:1340:14: error: 'sc::opencl::OpAverage' is an incomplete type
| Log |
|
| libs3 | 2.0-3 | inc/request.h:131:14: error: sizeof on pointer operation will return size of 'char *' instead of 'char [9]' [-Werror,-Wsizeof-array-decay]
| Log |
|
| libtemplates-parser | 20-3 | Undetected error | Log |
|
| libtorrent-rasterbar | 1.2.5-1 | clang: error: clang frontend command failed due to signal (use -v to see invocation)
| Log |
|
| libutempter | 1.1.6-6 | utempter.c:167:32: error: unknown warning group '-Wstringop-truncation', ignored [-Werror,-Wunknown-warning-option]
| Log |
|
| libwx-perl | 1:0.9932-5 | dh_auto_configure: error: perl -I. Makefile.PL INSTALLDIRS=vendor "OPTIMIZE=-g -O2 -fdebug-prefix-map=/<>=. -fstack-protector-strong -Wformat -Werror=format-security -Wdate-time -D_FORTIFY_SOURCE=2" "LD=x86_64-linux-gnu-gcc -g -O2 -fdebug-prefix-map=/<>=. -fstack-protector-strong -Wformat -Werror=format-security -Wl,-z,relro -Wl,-z,now" returned exit code 2
| Log |
|
| libwx-scintilla-perl | 0.39-4 | Undetected error | Log |
|
| lierolibre | 0.5-3 | ./src/gvl/io/encoding.hpp:586:19: error: cast from pointer to smaller type 'uint32_t' (aka 'unsigned int') loses information
| Log |
|
| llvmlite | 0.32.0-1 |
| Log |
|
| lookup | 1.08b-12 | lib/romaji2kana.c:59:12: error: source file is not valid UTF-8
| Log |
|
| lordsawar | 0.3.2+frogknows-1 | ../../src/setlist.h:318:32: error: no class named 'const_iterator' in 'SetList'
| Log |
|
| mclibs | 20061220+dfsg3-3.1 | Undetected error | Log |
|
| memtest86 | 4.3.7-3 | main.c:229:2: error: indirect goto in function with no address-of-label expressions
| Log |
|
| memtest86+ | 5.01-3.1 | main.c:223:2: error: indirect goto in function with no address-of-label expressions
| Log |
|
| mes | 0.22-1 | checking for cc is Mes C....config.c:2:2: error: no mesc
| Log |
|
| mia | 2.4.7-1 | src.cxx:5:2: error: Altivec not supported
| Log |
|
| midori | 7.0-2.1 |
| Log |
|
| mira | 4.9.6-4 | configure: error: Could not link against boost_thread !
| Log |
|
| mona | 1.4-17-2 | configure: error: C++ compiler not found
| Log |
|
| mpich | 3.4~a2+really3.3.2-1 | configure: error: Unable to configure with Fortran support because configure could not determine the size of a Fortran INTEGER. Consider setting CROSS_F77_SIZEOF_INTEGER to the length in bytes of a Fortran INTEGER
| Log |
|
| mrs | 6.0.5+dfsg-7 | Undetected error | Log |
|
| newsboat | 2.19-1 | /usr/bin/curl-config: 1: krb5-config: not found
| Log |
|
| nfstrace | 0.4.3.2+git20180104+6561cf6-1 | parser_thread.h:47:19: error: braces around scalar initializer [-Werror,-Wbraced-scalar-init]
| Log |
|
| nn | 6.7.3-12 | make[3]: *** No rule to make target ' articles.h', needed by 'nn.o'. Stop.
| Log |
|
| odb | 2.4.0-12 | ../odb/relational/header.hxx:56:24: error: non-const lvalue reference to type 'semantics::data_member' cannot bind to a value of unrelated type 'relational::header::image_member_impl::member_info' (aka 'relational::member_base_impl::member_info')
| Log |
|
| odb-api | 0.18.1-12 | dh_auto_configure: error: cd debian/build && cmake -DCMAKE_INSTALL_PREFIX=/usr -DCMAKE_BUILD_TYPE=None -DCMAKE_INSTALL_SYSCONFDIR=/etc -DCMAKE_INSTALL_LOCALSTATEDIR=/var -DCMAKE_EXPORT_NO_PACKAGE_REGISTRY=ON -DCMAKE_FIND_PACKAGE_NO_PACKAGE_REGISTRY=ON -DCMAKE_INSTALL_RUNSTATEDIR=/run "-GUnix Makefiles" -DCMAKE_VERBOSE_MAKEFILE=ON -DCMAKE_AUTOGEN_VERBOSE=ON -DCMAKE_INSTALL_LIBDIR=lib/x86_64-linux-gnu -DCMAKE_MODULE_PATH=/usr/share/ecbuild/cmake -DDISABLE_AIO=ON -DCMAKE_BUILD_TYPE=Release -DDISABLE_OS_CHECK=ON -DBUILD_SHARED_LIBS=ON -DENABLE_EIGEN=ON -DENABLE_NETCDF=ON -DENABLE_FORTRAN=ON -DCMAKE_Fortran_MODULE_DIRECTORY=/fortran/gfortran-mod-15 -DENABLE_PYTHON=ON -DENABLE_OMP=ON -DENABLE_ODB=ON -DENABLE_ODB_MPI=ON -DENABLE_ODB_API_SERVER_SIDE=ON -DPYTHON_EXECUTABLE=/usr/bin/python3.8 ../.. returned exit code 1
| Log |
|
| odil | 0.12.0-2 | Undetected error | Log |
|
| ogmrip | 1.0.1-3 | ogmrip-encoding.c:1200:7: error: cast to union type from type 'int' not present in union
| Log |
|
| opa-ff | 10.8.0.0.201+dfsg.1-1 | clang: error: clang frontend command failed due to signal (use -v to see invocation)
| Log |
|
| opengrm-ngram | 1.3.2-3 | Undetected error | Log |
|
| openhpi | 3.8.0-2 | ipmi.cpp:1561:83: error: alias must point to a defined variable or function
| Log |
|
| openjade | 1.4devel1-21.3 | configure: error: cannot compute sizeof (size_t)
| Log |
|
| openmsx | 0.15.0-2 | src/utils/strCat.hh:424:8: error: 'auto' return without trailing return type; deduced return types are a C++14 extension
| Log |
|
| openmsx-catapult | 0.15.0-2 | Undetected error | Log |
|
| openvpn-auth-ldap | 2.0.4-1 | configure: error: Can't locate Objective C runtime headers
| Log |
|
| oregano | 0.84.41+dfsg.1-1 |
| Log |
743871
|
| packagekit | 1.1.13-2 | configure: error: need libapt-pkg 1.1 or later
| Log |
|
| packagesearch | 2.7.11 |
| Log |
|
| pan | 0.146-1 | text-match.cc:476:8: error: no viable conversion from 'pan::StringView' to 'std::__cxx11::basic_string'
| Log |
|
| pango1.0 | 1.44.7-4 | ../pango/break.c:409:4: error: unannotated fall-through between switch labels [-Werror,-Wimplicit-fallthrough]
| Log |
|
| pari | 2.11.4-1 | Undetected error | Log |
|
| passwordsafe | 1.09.0+dfsg-2 | clang: error: clang frontend command failed due to signal (use -v to see invocation)
| Log |
|
| paw | 1:2.14.04.dfsg.2-9.1 | Undetected error | Log |
|
| pcp | 5.1.0-1 | access.o: r .L.str.1 : Error: additional symbol
| Log |
|
| pingus | 0.7.6-5.1 | src/lisp/getters.hpp:33:15: error: no viable conversion from 'std::shared_ptr' to 'const lisp::Lisp *'
| Log |
|
| pplpy | 0.8.4-4 | ppl.hh:66465:8: error: missing 'typename' prior to dependent type template name 'OR_Matrix::Pseudo_Row'
| Log |
|
| prime-phylo | 1.0.11-8 | ODESolver.hh:359:20: error: in-class initializer for static data member of type 'const beep::Real' (aka 'const double') requires 'constexpr' specifier [-Wstatic-float-init]
| Log |
|
| primus | 0~20150328-10 | ./gl-passthru.def:2:1: error: ifunc must point to a defined function
| Log |
|
| python3.8 | 3.8.3~rc1-1 | configure: error: in `/<>/build-static'
| Log |
|
| qgis | 3.10.5+dfsg-1 | clang: error: clang frontend command failed due to signal (use -v to see invocation)
| Log |
|
| qtop | 2.3.4-2 | File.h:327:18: error: qualified reference to 'File' is a constructor name rather than a type in this context
| Log |
|
| qtwebengine-opensource-src | 5.12.5+dfsg-7 | Undetected error | Log |
|
| quickfix | 1.15.1+dfsg-4 | Undetected error | Log |
|
| raidutils | 0.0.6-22 | E: apt-cache returned no information about raidutils source
| Log |
|
| ruby2.5 | 2.5.7-1 | W: Unable to locate package ruby2.5
| Log |
|
| sachesi | 2.0.4+ds-2 | src/installer_establish.cpp:22:13: error: static declaration of 'wolfSSL_RSA_get0_key' follows non-static declaration
| Log |
|
| safeclib | 3.5-3 | test_mbsrtowcs_s.c:269:10: error: len overflow >dmax
| Log |
|
| samblaster | 0.1.25-1 | Undetected error | Log |
|
| scalapack | 2.1.0-2 |
| Log |
710395
|
| scanbd | 1.5.1-6 | Undetected error | Log |
|
| scantool | 2.1-2 | about.c:36:100: error: illegal character encoding in string literal [-Werror,-Winvalid-source-encoding]
| Log |
|
| scipy | 1.4.1-2 | Undetected error | Log |
|
| simutrans | 120.4.1-1 | E: apt-cache returned no information about simutrans source
| Log |
750121
|
| sks-ecc | 0.93-6 | tfm/mpi.c:2565:15: error: unknown register name '%cc' in asm
| Log |
|
| soundmodem | 0.20-5 | ../matlib/mat.hh:452:6: error: assigning to 'unsigned int *' from incompatible type 'void *'
| Log |
|
| sparse | 0.6.1-2 | +/usr/include/stdio.h:27:11: error: unable to open 'bits/libc-header-start.h'
| Log |
|
| stdsyslog | 0.03.3-3 | stdsyslog.c:560:121: error: format specifies type 'void *' but the argument has type 'char *' [-Werror,-Wformat-pedantic]
| Log |
|
| stunnel4 | 3:5.56-1 | E: apt-cache returned no information about stunnel4 source
| Log |
|
| subtitleeditor | 0.54.0-4 | document.cc:81:40: error: addition of default argument on redeclaration makes this constructor a copy constructor
| Log |
|
| sugar-toolkit-gtk3 | 0.117-1 | Undetected error | Log |
|
| systemd | 245.5-2 |
| Log |
|
| tagcoll2 | 2.0.14-2 |
| Log |
|
| tcptrack | 1.4.2-2 | ./IPAddress.h:19:58: error: all paths through this function will call itself [-Werror,-Winfinite-recursion]
| Log |
|
| thin-provisioning-tools | 0.8.5-4 | Undetected error | Log |
|
| timemon.app | 4.2-2 |
| Log |
|
| transfermii | 1:0.6.1-4 | wiimotefunctions.c:41:10: error: cannot compile this static initializer yet
| Log |
|
| troffcvt | 1.04-24 | Undetected error | Log |
|
| tvc | 5.0.3+git20151221.80e144e+dfsg-3 | Utils.cpp:318:16: error: variable-sized object may not be initialized
| Log |
|
| u-boot | 2020.04+dfsg-2 | Undetected error | Log |
|
| uhub | 0.4.1-3.1 |
| Log |
|
| upx-ucl | 3.96-1 | ./../src/lzma-sdk/C/7zip/Compress/LZMA/LZMAEncoder.cpp:971:9: error: misleading indentation; statement is not part of the previous 'if' [-Werror,-Wmisleading-indentation]
| Log |
|
| v4l-utils | 1.18.0-2 | E: apt-cache returned no information about v4l-utils source
| Log |
|
| vsearch | 2.14.1-3 | configure: error: in `/<>'
| Log |
|
| wav2cdr | 2.3.4-3 | wav2cdr.c:137:2: error: ./chelp.hexpected expression:
| Log |
|
| wrapperfactory.app | 0.1.0-5 |
| Log |
|
| wsclean | 2.9-2 | parallelfor.h:84:18: error: object of type 'ao::Barrier' cannot be assigned because its copy assignment operator is implicitly deleted
| Log |
|
| wsjtx | 2.1.2+repack-2 | f95: error: unrecognized command line option ‘-fopenmp=libomp’; did you mean ‘-fopenmp-simd’?
| Log |
|
| wvdial | 1.61-5 | uniconfgen.h:323:19: error: no class named 'Iter' in 'UniConfGen'
| Log |
|
| wvstreams | 4.6.1-14 | ./include/wvscatterhash.h:186:46: error: invalid use of non-static data member 'xstatus'
| Log |
|
| xcftools | 1.0.7-6 | Undetected error | Log |
|
| xfsprogs | 5.6.0-1 | configure: error: LTO not supported by compiler.
| Log |
|
| xmlcopyeditor | 1.2.1.3-4 | myipc.cpp:49:4: error: cannot initialize a member subobject of type 'WXWidget' (aka '_GtkWidget *') with an rvalue of type 'wxIntPtr' (aka 'long')
| Log |
|
| xmms2 | 0.8+dfsg-18.2 | coll.h:615:6: error: binding reference of type 'Xmms::Coll::Coll' to value of type 'const Xmms::Coll::Coll' drops 'const' qualifier
| Log |
|
| xmpi | 2.2.3b8-14 | configure: error: cannot continue -- cannot find
| Log |
|
| yp-tools | 3.3-5.3 | yp_order.c:42:26: error: cast from 'struct ypresp_order *' to 'ypresp_val *' (aka 'struct ypresp_val *') increases required alignment from 4 to 8 [-Werror,-Wcast-align]
| Log |
|
| yrmcds | 1.1.8-1.1 | Undetected error | Log |
|
| z80ex | 1.1.21-1 | dh_install: error: missing files, aborting
| Log |
|
| zeitgeist | 1.0.2-3 | controller.cpp:131:19: error: cannot cast from type 'gboolean (ZeitgeistFTS::Controller::*)()' to pointer type 'GSourceFunc' (aka 'int (*)(void *)')
| Log |
|
| zeroc-ice | 3.7.3-1 | include/generated/Ice/LocalException.h:3853:40: error: dynamic exception specifications are deprecated [-Werror,-Wdeprecated-dynamic-exception-spec]
| Log |
|
| zimlib | 4.0.4-5 | version.h:29:2: error: The C++ ABI version of compiler you are using does not exactly match [-Werror,-W#warnings]
| Log |
|
| zookeeper | 3.4.13-5 | [javadoc] /<>/src/java/main/org/apache/zookeeper/server/NettyServerCnxnFactory.java:21: error: package org.jboss.netty.buffer does not exist
| Log |
|
| zynaddsubfx | 3.0.5-2 | PluginTest.h:235: Error: Assertion failed: fdata == result
| Log |
|