Debian Package rebuild

Rebuild of the Debian archive with clang

"No matching member or constructor call" build failure(s)
clang 3.5.0
Return to the list

Versions: 2.9 - 3.0 - 3.1 - 3.2 - 3.3 - 3.4 - 3.4.2 - 3.5.0 - 3.6.0 - 3.8.1
PackageVersionSupposed error messageFull log Bug report
dnaclust 3-2./multi_dim.hpp:62:8: error: no matching constructor for initialization of 'std::range_error' Log
gpsshogi 0.6.0-3dualThreatmateState.h:14:11: error: no matching constructor for initialization of 'volatile struct Flags' Log
liblip 2.0.0-1.2tnt_sparse_matrix_csr.h:97:3: error: no matching constructor for initialization of 'Array1D' Log
reconserver 0.10.3-1new_allocator.h:130:28: error: no matching constructor for initialization of 'std::auto_ptr' Log
4 errors
Return to the list