Debian Package rebuild

Rebuild of the Debian archive with clang

"Argument unused caused failure" build failure(s)
clang 3.5.0
Return to the list
Unknown or unused arguments triggers errors with -Werror:
clang -Werror -ggdb3 foo.c

Versions: 2.9 - 3.0 - 3.1 - 3.2 - 3.3 - 3.4 - 3.4.2 - 3.5.0 - 3.6.0 - 3.8.1
PackageVersionSupposed error messageFull log Bug report
criu 1.3-1clang: error: argument unused during compilation: '-Wa,--noexecstack' Log 753845
dwb 20140702hg-1clang: error: argument unused during compilation: '--ansi' Log
libwebsockets 1.2.2-1clang: error: argument unused during compilation: '-rdynamic' Log
lxc 1:1.0.5-2clang: error: argument unused during compilation: '-L../../src/lxc/' Log
policycoreutils 2.3-1clang: error: argument unused during compilation: '-shared' Log
spice-vdagent 0.15.0-1.1clang: error: argument unused during compilation: '-Wp,-D_FORTIFY_SOURCE=2' Log
6 errors
Return to the list